{"text_format":"1","workbook":"xlsx","n_sheets":9,"sheets":["Tech","Content","1. Summary","2. Macro","3. GGbudget","4. Municipalities","5. SurplusGG","6. GGexpenditure","7. GGbudgets"],"not_rendered":{"charts":0,"images":2,"macros":1,"external_links":1,"defined_names":9,"comments":3,"pivot_tables":0},"unopened":[],"bounds":{"document_bytes":16777216,"sheet_cells":100000,"rows_first":2000,"rows_last":500,"rows_between":2000,"halvings":0,"cell_chars":16384,"cell_head_chars":4096},"cells_cut":0,"cells_raw":0,"read":"whole","date_system":"1900"}

{"sheet":"Tech","index":0,"n_rows":2,"n_cols":1,"rows_kept":2,"cut":false,"hidden":true,"merged":[]}
["LT"]
["EN"]

{"sheet":"Content","index":1,"n_rows":31,"n_cols":7,"rows_kept":31,"cut":false,"hidden":false,"merged":[[11,5,11,7],[15,5,15,7],[21,5,21,7],[27,5,27,7],[0,2,0,4],[27,2,27,3],[11,2,11,3],[15,2,15,3],[21,2,21,3],[5,2,5,3],[7,2,7,3],[3,2,3,3],[3,5,3,7],[7,5,7,7]]}
[]
[null,"LT","◄","Switch to English",null,"◄","Rodyti lietuviškai"]
[]
[null,null,"FISKALINĖS DRAUSMĖS TAISYKLIŲ LAIKYMOSI SKAIČIUOKLĖ",null,null,"SPREADSHEET OF THE FULFILMENT OF FISCAL DISCIPLINE RULES  "]
[]
[null,null,"2019-11-12",null,null,null,"2019-11-12"]
[]
[null,null,"APRAŠYMAS",null,null,"DESCRIPTION"]
[]
[null,null,null,"Fiskalinės sutarties įgyvendinimo konstituciniame įstatyme Nr. XII-1289 (toliau − KĮ) nustatytų fiskalinės drausmės taisyklių skaičiuoklė skirta skaidriai parodyti fiskalinės drausmės taisykles, pagal kurias priimami sprendimai. 1 dalis pateikia skaičiavimams reikalingų duomenų įvestis ir nurodo šių duomenų šaltinius. 2 dalyje nagrinėjamos trys taisyklių grupės: perteklinio valdžios sektoriaus (toliau − VS) taisyklė; VS išlaidų augimą ribojimo taisyklė ir VS priskiriamų biudžetų taisyklės.",null,null,"Constitutional Law on the Implementation of the Fiscal Treaty Nr. XII-1289 (hereinafter − CL) defines fiscal discipline rules. The aim of this spreadsheet is to show the fiscal discipline rules, which are used for making decisions in a transparent way.  Part 1 provides required input data with their appropriate sources. In part 2 three groups of the fiscal rules are validated: general government (hereinafter − GG) surplus rule; GG sector expenditure growth limiting rule and rules for the budgets attributable to GG.   "]
[]
[null,null,"SUVESTINĖ",null,null,"SUMMARY"]
[]
[null,null,null,"1 lentelė. Fiskalinės drausmės taisyklių laikymosi suvestinė",null,null,"Table 1. Summary of the fulfilment of the fiscal discipline rules "]
[]
[null,null,"1. DUOMENYS",null,null,"1 . DATA"]
[]
[null,null,null,"2 lentelė. Makroekonominiai ir ciklo rodikliai",null,null,"Table 2. Macroeconomic and cyclical indicators"]
[null,null,null,"3 lentelė. VS fiskaliniai rodikliai",null,null,"Table 3. GG fiscal indicators"]
[null,null,null,"4 lentelė. Vietos valdžios biudžetai",null,null,"Table 4. Budget attributable to local government"]
[]
[null,null,"2. FISKALINĖS TAISYKLĖS",null,null,"2. FISCAL RULES"]
[]
[null,null,null,"5 lentelė. Perteklinio VS taisyklė",null,null,"Table 5. Surplus GG rule"]
[null,null,null,"6 lentelė. VS išlaidų augimo ribojimo taisyklė",null,null,"Table 6. GG expenditure growth limiting rule"]
[null,null,null,"7 lentelė. VS priskiriamų biudžetų taisyklė",null,null,"Table 7. Rules for the budgets attributable to GG sector"]
[]
[null,null,"NUORODOS",null,null,"REFERENCES"]
[]
[null,null,"KĮ","Lietuvos Respublikos fiskalinės sutarties įgyvendinimo konstitucinis įstatymas",null,"CL","Republic of Lithuania Constitutional Law on the Implementation of the Fiscal Treaty"]
[null,null,"FDĮ","Lietuvos Respublikos fiskalinės drausmės įstatymas",null,"FDL","Republic of Lithuania Fiscal Discipline Law"]

{"sheet":"1. Summary","index":2,"n_rows":24,"n_cols":7,"rows_kept":24,"cut":false,"hidden":false,"merged":[[23,2,23,3],[8,2,8,3],[8,5,8,6],[22,2,22,3],[15,4,15,6],[9,4,9,6],[10,4,11,4],[23,5,23,6],[22,5,22,6],[0,4,0,5],[20,1,20,3],[5,1,5,3],[9,1,9,3],[15,1,15,3],[2,1,2,3],[10,1,11,1],[6,1,7,1],[2,4,2,6],[5,4,5,6],[6,4,7,4]]}
[null,"↖ atgal į turinį",null,null,"↖ back to content"]
[{"$f":"Kalba","v":"LT"}]
[null,"1 lentelė. Fiskalinės drausmės taisyklių laikymosi suvestinė 2020 m.",null,null,"Table 1. Summary of the fulfilment of the fiscal discipline rules in year 2019"]
[null,"Taisyklė",null,null,"Rule"]
[null,"Institucija, kurios projekcijų pagrindu atliekama analizė","FM","IFI","Institution, projections of which are used for the analysis","MoF","IFI"]
[null,"Perteklinio VS taisyklė",null,null,"Surplus GG sector rule"]
[null,"Ar patenkinta bent viena perteklinio VS taisyklės sąlygų? ",{"$f":"'5. SurplusGG'!E14","v":"Taip"},{"$f":"'5. SurplusGG'!F14","v":"Ne"},"Is at least one condition of the surplus GG rule satisfied?",{"$f":"'5. SurplusGG'!J14","v":"Yes"},{"$f":"'5. SurplusGG'!K14","v":"No"}]
[null,null,{"$f":"'5. SurplusGG'!E15","v":"Tenkinama S2 sąlyga"},{"$f":"'5. SurplusGG'!F15","v":"Netenkinama nei viena iš sąlygų"},null,{"$f":"'5. SurplusGG'!J15","v":"Condition C2 is valid"},{"$f":"'5. SurplusGG'!K15","v":"None of the conditions is valid"}]
[null,"Ar t metai yra išskirtinių aplinkybių metai?","Ne",null,"Is year t a year of exceptional circumstances?",{"$f":"IF(C9=\"NE\",\"No\",\"Yes\")","v":"No"}]
[null,"VS išlaidų augimo ribojimo taisyklė",null,null,"GG expenditure growth limiting rule"]
[null,"Ar susidaro bent viena aplinkybė, leidžianti netaikyti VS išlaidų augimo ribojimo taisyklės?",{"$f":"'6. GGexpenditure'!F19","v":"Taip"},{"$f":"'6. GGexpenditure'!G19","v":"Taip"},"Is at least one escape clause, which allows switching off GG expenditure growth limiting rule, valid?",{"$f":"'6. GGexpenditure'!L19","v":"Yes"},{"$f":"'6. GGexpenditure'!M19","v":"Yes"}]
[null,null,{"$f":"'6. GGexpenditure'!F20","v":"Susidaro A3 aplinkybė"},{"$f":"'6. GGexpenditure'!G20","v":"Susidaro A3 aplinkybė"},null,{"$f":"'6. GGexpenditure'!L20","v":"Escape clause E3 emerges"},{"$f":"'6. GGexpenditure'!M20","v":"Escape clause E3 emerges"}]
[null,"Ar taikoma VS išlaidų augimą ribojimo taisyklė?",{"$f":"IF(C11=\"taip\",\"Netaikoma,\",\"Taikoma\")","v":"Netaikoma,"},{"$f":"IF(D11=\"taip\",\"Netaikoma,\",\"Taikoma\")","v":"Netaikoma,"},"Is GG expenditure growth limiting rule applied?",{"$f":"IF(F11=\"yes\",\"Not applied,\",\"Applied\")","v":"Not applied,"},{"$f":"IF(G11=\"yes\",\"Not applied,\",\"Applied\")","v":"Not applied,"}]
[null,null,{"$f":"'6. GGexpenditure'!F26","v":" nes susidarė viena iš KĮ numatytų netaikymo aplinkybių"},{"$f":"'6. GGexpenditure'!G26","v":" nes susidarė viena iš KĮ numatytų netaikymo aplinkybių"},null,{"$f":"'6. GGexpenditure'!L26","v":" since one of CL escape clauses emerged"},{"$f":"'6. GGexpenditure'!M26","v":" since one of CL escape clauses emerged"}]
[null,"Ar galioja VS išlaidų augimą ribojimo taisyklė?",{"$f":"IF(C11=\"taip\",\"Netikrinama\",'6. GGexpenditure'!F25)","v":"Netikrinama"},{"$f":"IF(D11=\"taip\",\"Netikrinama\",'6. GGexpenditure'!G25)","v":"Netikrinama"},"Is GG expenditure growth limiting rule valid?",{"$f":"IF(F11=\"yes\",\"Not verified\",'6. GGexpenditure'!L25)","v":"Not verified"},{"$f":"IF(G11=\"yes\",\"Not verified\",'6. GGexpenditure'!M25)","v":"Not verified"}]
[null,"VS priskiriamų biudžetų taisyklės",null,null,"Rules for the budgets attributable to GG sector"]
[null,{"$f":"'7. GGbudgets'!C8","v":"Taisyklė planuojamiems vietos valdžios sektoriaus (j) asignavimams, kurie viršija 0,3 proc. BVP"},{"$f":"'7. GGbudgets'!E8","v":"Netikrinama"},{"$f":"'7. GGbudgets'!F8","v":"Netikrinama"},{"$f":"'7. GGbudgets'!H8","v":"Rule for planned local governments (j) appropriations of which does exceed 0.3 % of GDP"},{"$f":"'7. GGbudgets'!J8","v":"Not verified"},{"$f":"'7. GGbudgets'!K8","v":"Not verified"}]
[null,{"$f":"'7. GGbudgets'!C18","v":"Taisyklė planuojamam VSDF struktūriniam biudžetui"},{"$f":"'7. GGbudgets'!E18","v":"Galioja"},{"$f":"'7. GGbudgets'!F18","v":"Galioja"},{"$f":"'7. GGbudgets'!H18","v":"Rule for SSIF structural budget"},{"$f":"'7. GGbudgets'!J18","v":"Valid"},{"$f":"'7. GGbudgets'!K18","v":"Valid"}]
[null,{"$f":"'7. GGbudgets'!C12","v":"Taisyklė planuojamam PSDF struktūriniam biudžetui"},{"$f":"'7. GGbudgets'!E12","v":"Galioja"},{"$f":"'7. GGbudgets'!F12","v":"Galioja"},{"$f":"'7. GGbudgets'!H12","v":"Rule for NHIF structural budget"},{"$f":"'7. GGbudgets'!J12","v":"Valid"},{"$f":"'7. GGbudgets'!K12","v":"Valid"}]
[null,{"$f":"'7. GGbudgets'!C22","v":"Taisyklė planuojamiems vietos valdžios sektoriaus (j) asignavimams, kurie neviršija 0,3 proc. BVP"},{"$f":"'7. GGbudgets'!E22","v":"Netikrinama"},{"$f":"'7. GGbudgets'!F22","v":"Netikrinama"},{"$f":"'7. GGbudgets'!H22","v":"Rule for planned local governments (j) appropriations of which does not exceed 0.3 % of GDP"},{"$f":"'7. GGbudgets'!J22","v":"Not verified"},{"$f":"'7. GGbudgets'!K22","v":"Not verified"}]
[]
[null,"Šaltiniai:",null,null,"Sources:"]
[null,"Finansų ministerija","FM",null,"Ministry of Finance","MoF"]
[null,"Fiskalinė institucija","IFI",null,"Independent Fiscal Institution","IFI"]

{"sheet":"2. Macro","index":3,"n_rows":48,"n_cols":17,"rows_kept":48,"cut":false,"hidden":false,"merged":[[35,2,36,2],[28,2,29,2],[35,3,36,3],[28,4,29,4],[35,4,36,4],[33,2,34,2],[33,3,34,3],[33,4,34,4],[28,1,29,1],[16,1,17,1],[12,1,13,1],[22,1,23,1],[35,1,36,1],[33,1,34,1],[26,2,27,2],[22,2,23,2],[10,1,11,1],[8,1,9,1],[6,1,7,1],[26,1,27,1],[24,1,25,1],[24,2,25,2],[0,3,0,4],[20,1,21,1],[20,2,21,2],[14,1,15,1],[14,2,15,2],[18,1,19,1],[18,2,19,2],[16,2,17,2],[16,3,17,3],[12,2,13,2],[10,2,11,2],[8,2,9,2],[6,2,7,2],[3,1,4,1],[6,3,7,3],[8,3,9,3],[3,13,3,16],[3,6,3,12],[3,2,4,2],[2,1,2,2],[3,3,4,3],[3,4,4,4],[2,3,2,4],[3,5,4,5],[10,3,11,3],[12,3,13,3],[14,3,15,3],[18,3,19,3],[20,3,21,3],[16,4,17,4],[18,4,19,4],[20,4,21,4],[22,4,23,4],[26,4,27,4],[6,4,7,4],[8,4,9,4],[10,4,11,4],[12,4,13,4],[14,4,15,4],[24,3,25,3],[24,4,25,4],[22,3,23,3],[26,3,27,3],[28,3,29,3]]}
[null,"↖ atgal į turinį",null,"↖ back to content"]
[{"$f":"Kalba","v":"LT"}]
[null,"2 lentelė.    Makroekonominiai ir ciklo rodikliai",null,"Table 2. Macroeconomic and cyclical indicators"]
[null,"Rodiklis ","Žymėjimas | Formulė                    ","Indicator","Notation | Formula",{"$f":"IF(A2=\"LT\",\"Duomenys atnaujinti\",\"Data updated on\")","v":"Duomenys atnaujinti"},{"$f":"IF(A2=\"LT\",\"Faktas\",\"Actuals\")","v":"Faktas"},null,null,null,null,null,null,{"$f":"CONCATENATE(\"2019-09-11\",IF(A2=\"LT\",\" Projekcijos\",\" Projections\"))","v":"2019-09-11 Projekcijos"}]
[null,null,null,null,null,null,2012,{"$f":"G5+1","v":2013},2014,2015,2016,2017,2018,{"$f":"CONCATENATE(M5+1,\"P\")","v":"2019P"},{"$f":"CONCATENATE(M5+2,\"P\")","v":"2020P"},{"$f":"CONCATENATE(M5+3,\"P\")","v":"2021P"},{"$f":"CONCATENATE(M5+4,\"P\")","v":"2022P"}]
[null,"Laikas","T","Time","T",null,"t–8","t−7","t−6","t−5","t−4","t−3","t−2","t−1","t","t+1","t+2"]
[null,"Nominalus BVP, mln. EUR","YN(T)","Nominal GDP, million EUR","YN(T)","2019-10-01",33331.699999999997,34985,36544.800000000003,37321.800000000003,38893.4,42269.4,45264.4,{"$f":"M7*(1+N10%)","v":48494.418850914291},{"$f":"N7*(1+O10%)","v":51032.088778962476},{"$f":"O7*(1+P10%)","v":53305.45258691661},{"$f":"P7*(1+Q10%)","v":55644.110620743762}]
[null,null,null,null,null,"2019-08-30",33348.476238320502,34959.646115801792,36568.280632331574,37433.906318481269,38849.432230518913,42190.830837764501,45113.834149423667,48333.108783344796,50862.337498625369,53128.13927205759,55459.018079029411]
[null,"Nominalus BVP, metinis augimas proc.","ΔYN(T)=(YN(T)/YN(T–1)–1)∙100","Nominal GDP growth, annual % change","ΔYN(T)=(YN(T)/YN(T–1)–1)∙100",{"$f":"$F$7","v":"2019-10-01"},null,{"$f":"(H7/G7-1)*100","v":4.9601430470093133},4.4584822066600083,2.1261574834176233,4.2109437379761916,8.680135961371338,7.085503934288151,{"$f":"(N7/M7-1)*100","v":7.1358923368348925},5.2329113085151313,4.4547731875151264,4.3872773240483776]
[null,null,null,null,null,{"$f":"$F$8","v":"2019-08-30"},null,4.8313148282016716,4.601403890649447,2.3671489913702937,3.7814004768687237,8.6008943127376938,6.9280534505208768,7.1358923368348925,5.2329113085151313,4.4547731875151264,4.3872773240483776]
[null,"Realus BVP, mln. EUR","YR(T)","Real GDP, million EUR","YR(T)",{"$f":"$F$7","v":"2019-10-01"},30776,31871.1,32989.199999999997,33659.9,34520.199999999997,35986.5,37298.1,{"$f":"M11*(1+N14%)","v":38668.538316516715},{"$f":"N11*(1+O14%)","v":39607.860372091323},{"$f":"O11*(1+P14%)","v":40535.910530735491},{"$f":"P11*(1+Q14%)","v":41487.312908666347}]
[null,null,null,null,null,{"$f":"$F$8","v":"2019-08-30"},30858.83222900562,31938.453389413542,33068.303586843584,33736.490956871625,34530.371756547451,35959.911413016234,37216.238801321553,38583.669304483039,39520.929752913733,40446.943043770523,41396.25730088335]
[null,"Realus BVP, metinis augimas proc.","ΔYR(T)=(YR(T)/YR(T–1)–1)∙100","Real GDP growth, annual % change","ΔYR(T)=(YR(T)/YR(T–1)–1)∙100",{"$f":"$F$7","v":"2019-10-01"},null,{"$f":"(H11/G11-1)*100","v":3.5582921757213448},3.5081939437295873,2.0330896172080726,2.5558602372556027,4.2476578930597197,{"$f":"(M11/L11-1)*100","v":3.6447000958692799},3.6742845252619283,2.429163595184014,2.3430959156230946,2.3470605827627278]
[null,null,null,null,null,{"$f":"$F$8","v":"2019-08-30"},null,3.4985807382339473,3.5375858174915509,2.0206279051275144,2.35318130949278,4.1399486415831133,3.4936887743571399,3.6742845252619283,2.429163595184014,2.3430959156230946,2.3470605827627278]
[null,"Potencialus BVP, mln. EUR","Y*(T)","Potential GDP, million EUR","Y*(T)","2019-10-28",31661.7008692052,32251.262408353901,32910.336982036803,33639.298757854704,34422.648646877497,35295.299158568298,36292.999466669302,37379.937220754902,38556.310958583803,39797.682817436696,41088.300477660501]
[null,null,null,null,null,"2019-09-18",31720.829455213894,32315.677262992707,32964.580986578279,33616.38881378682,34196.317446217821,34947.737858954475,35931.248920209997,37260.931833014685,38670.115492983889,39945.30617384291,41121.118124919332]
[null,"Potencialus BVP, metinis augimas proc.","ΔY*(T)=(Y*(T)/Y*(T–1)–1)∙100","Potential GDP growth, annual % change","ΔY*(T)=(Y*(T)/Y*(T–1)–1)∙100",{"$f":"$F$15","v":"2019-10-28"},null,{"$f":"(H15/G15-1)*100","v":1.8620652806499161},{"$f":"(I15/H15-1)*100","v":2.0435620948350275},2.2149933506174113,2.3286748474204755,2.5351056528009508,2.8267229117926451,{"$f":"(N15/M15-1)*100","v":2.9948964540222667},3.1470725348776929,3.2196333829404455,3.242946746784825]
[null,null,null,null,null,{"$f":"$F$16","v":"2019-09-18"},null,{"$f":"(H16/G16-1)*100","v":1.8752593106642124},{"$f":"(I16/H16-1)*100","v":2.0080152376341642},1.9772974741402827,1.7251366160816239,2.197372316239754,2.814233828881485,3.700630934809479,3.7819334907792435,3.2976128066914745,2.9435547344643265]
[null,"Atotrūkis nuo potencialo, proc. pot. BVP","AP(T)=(YR(T)/Y*(T)–1)∙100","Output gap (OG), % pot. GDP","OG(T)=(YR(T)/Y*(T–1)–1)∙100",{"$f":"$F$15","v":"2019-10-28"},{"$f":"(G$11/G15-1)*100","v":-2.7973887848414702},{"$f":"(H11/H15-1)*100","v":-1.1787520238445981},0.23962993149002632,6.1241592143734813E-2,0.28339293156440792,1.9583368264606493,2.769406078584824,3.4473067414525493,{"$f":"(O11/O15-1)*100","v":2.7273081562109613},1.8549514972649339,0.97110960143700353]
[null,null,null,null,null,{"$f":"$F$16","v":"2019-09-18"},{"$f":"(G$12/G16-1)*100","v":-2.7174485693235551},{"$f":"(H$12/H16-1)*100","v":-1.1673091995232698},{"$f":"(I$12/I16-1)*100","v":0.31464862334376065},0.35727259031328451,0.97687217594413234,2.8962491310504435,{"$f":"(M$12/M16-1)*100","v":3.5762460802991836},{"$f":"(N$12/N16-1)*100","v":3.5499312722403698},{"$f":"(O$12/O16-1)*100","v":2.2001854638479479},{"$f":"(P$12/P16-1)*100","v":1.255809300207833},0.66909458815829215]
[null,"Ciklinė VS biudžeto dedamoji, proc. pot. BVP","CB(T) = ε∙AP(T)","Cyclical GG budgetary component, % pot. GDP","CB(T) = ε∙OG(T)",{"$f":"$F$15","v":"2019-10-28"},{"$f":"G19*G38","v":-1.1161581251517467},{"$f":"H19*H38","v":-0.47032205751399464},9.5612342664520511E-2,2.4435395265350192E-2,0.11307377969419877,0.7813763937577991,1.1049930253553448,{"$f":"N19*N38","v":1.3754753898395673},{"$f":"O19*O38","v":1.0881959543281736},0.74012564740870868,0.38747273097336443]
[null,null,null,null,null,{"$f":"$F$16","v":"2019-09-18"},{"$f":"G20*G38","v":-1.0842619791600985},-0.4657563706097847,0.12554480071416049,0.14255176353500051,{"$f":"K20*K38","v":0.38977199820170882},1.1556034032891269,1.4269221860393744,{"$f":"N20*N38","v":1.4164225776239077},{"$f":"O20*O38","v":0.87787400007533123},{"$f":"P20*P38","v":0.50106791078292534},0.26696874067515858]
[null,"Ciklinė VSDF biudžeto dedamoji, proc. pot. BVP","CBVSDF(T) = εVSDF∙AP(T)","Cyclical SSIF budgetary component, % pot. GDP","CBSSIF(T) = εSSIF∙OG(T)",{"$f":"$F$15","v":"2019-10-28"},{"$f":"G19*G39","v":-0.28132031850806599},{"$f":"H19*H39","v":-0.11854158298871643},{"$f":"I19*I39","v":2.4098462471908624E-2},6.1587807533849464E-3,2.8499502894500883E-2,0.19694078375923926,0.27850622849687601,{"$f":"N19*N39","v":0.34667953048056327},{"$f":"O19*O39","v":0.27427263715808253},0.18654380429896444,9.7659954834622989E-2]
[null,null,null,null,null,{"$f":"+F26","v":"2019-10-28"},{"$f":"G20*G39","v":-0.27328110457650023},{"$f":"H20*H39","v":-0.11739083161652547},{"$f":"I20*I39","v":3.1642741765766945E-2},3.5929234951455211E-2,9.8239470025559814E-2,0.29126224157361591,0.35964635728315597,{"$f":"N20*N39","v":0.35699999999999998},{"$f":"O20*O39","v":0.22126237111571115},{"$f":"P20*P39","v":0.12629087320083751},6.7287716199012748E-2]
[null,"Ciklinė PSDF biudžeto dedamoji, proc. pot. BVP","CBPSDF(T) = εPSDF∙AP(T)","Cyclical NHIF budgetary component, % pot. GDP","CBNHIF(T) = εNHIF∙OG(T)",{"$f":"$F$15","v":"2019-10-28"},null,null,null,null,null,null,null,{"$f":"N19*N40","v":0.15634567060888149},{"$f":"O19*O40","v":0.12369158146344898},{"$f":"P19*P40","v":8.4127598017180047E-2},4.4042724729339781E-2]
[null,null,null,null,null,"2019-10-28",null,null,null,null,null,null,null,{"$f":"N20*N40","v":0.161},{"$f":"O20*O40","v":9.9784990895320724E-2},{"$f":"P20*P40","v":5.6954707521946334E-2},3.0345440638770458E-2]
[null,"BVP defliatorius, 2010 = 100","PY(T) = YN(T)/YR(T)","GDP deflator, 2010 = 100","PY(T) = YN(T)/YR(T)",{"$f":"$F$7","v":"2019-10-01"},{"$f":"G7/G11*100","v":108.30419807642318},109.77029346335709,110.77807282383327,110.87911728793016,112.66852451608045,117.45904714267851,121.35846061863742,{"$f":"N7/N11*100","v":125.41053001271732},128.84333639723934,131.50180146193802,134.12319747784915]
[null,null,null,null,null,{"$f":"$F$8","v":"2019-08-30"},{"$f":"G8/G12*100","v":108.06784907101816},109.4594208728644,110.58408404984064,110.95969158836461,112.50800456022461,117.32740482361947,121.22083155759864,{"$f":"N8/N12*100","v":125.26830561894995},128.69721895871004,131.35266913636426,133.9710923041489]
[null,"BVP defliatorius, metinis augimas proc.","ΔPY(T)=(PY(T)/PY(T–1)–1)∙100","GDP deflator, annual % change","ΔPY(T)=(PY(T)/PY(T)–1)∙100",{"$f":"$F$7","v":"2019-10-01"},null,{"$f":"(H27/G27-1)*100","v":1.3536828793094369},{"$f":"(I27/H27-1)*100","v":0.91808022797406075},9.121341572495556E-2,1.6138361054079953,4.2518730472185684,3.3198068355026367,{"$f":"(N27/M27-1)*100","v":3.3389261642114088},2.737255303979591,2.0633314372598299,1.9934297376677845]
[null,null,null,null,null,{"$f":"$F$8","v":"2019-08-30"},null,{"$f":"(H28/G28-1)*100","v":1.2876834449918162},{"$f":"(I28/H28-1)*100","v":1.0274704251199474},0.33965786464775771,1.3953832690918988,4.2836065595804662,3.3184290915087011,3.3389261642114088,2.7372553039796133,2.0633314372598521,1.9934297376677623]
[null,"Vidutinė metinė SVKI infliacija","ΔSVKI(T)","Average annual HICP inflation","ΔHICP(T)",{"$f":"$F$8","v":"2019-08-30"},3.2,1.2,0.2,-0.7,0.7,3.7,2.5,2.4,2.2999999999999998,2.1,2]
[null,"ES nominalus BVP, mlrd. EUR","YNES(T)","EU nominal GDP, billion EUR","YNEU(T)","2019-10-28",13501.734,13615.0905,14091.4512,14854.106400000001,14984.2719,15410.2595,15898.311599999999]
[null,"ES nominalus BVP, metinis augimas proc.","ΔYNES(T)=(YNES(T)/YNES(T–1)–1)∙100","EU nominal GDP growth, annual % change","ΔYNEU(T)=(YNEU(T)/YNEU(T–1)–1)∙100",{"$f":"$F$32","v":"2019-10-28"},null,{"$f":"(H32/G32-1)*100","v":0.83956993968330451},3.4987699861414701,5.4121835230142912,0.87629303638216971,2.8428982258390523,{"$f":"(M32/L32-1)*100","v":3.1670595813133362}]
[null,"VS biudžeto balansas mln. EUR","BL(T)","Balance of GG budget, million EUR","BL(T)","2019-10-21",null,null,-226.19300000000001,-100.74,90.33,192.04,270.8]
[null,null,null,null,null,{"$f":"+F8","v":"2019-08-30"},null,null,-226.19300000000001,-100.74,90.3,192,270.8]
[null,"VS biudžeto balansas proc. BVP","B(T)=BL(T)/YN(T)","Balance of GG budget, % of GDP","B(T)=BL(T)/YN(T)",{"$f":"+F34","v":"2019-10-21"},null,null,-0.61926316626664135,{"$f":"J34/J7*100","v":-0.26992267253990959},0.23225020183373016,0.45432393173312136,0.59826265232721521,{"$f":"'3. GGbudget'!J7","v":1.109031846104358E-2}]
[null,null,null,null,null,{"$f":"F8","v":"2019-08-30"},null,null,-0.61926316626664135,-0.26911431348607145,0.23243582934286258,0.45507518147318188,0.60025933309740531,{"$f":"'3. GGbudget'!F7","v":5.6276123520063948E-2}]
[null,"VS biudžeto dalinis elastingumas pot. BVP","ε","Semi-elasticity of the GG budget to the OG","ε","2014-12-11",{"$f":"H38","v":0.39900000000000002},{"$f":"I38","v":0.39900000000000002},0.39900000000000002,0.39900000000000002,{"$f":"L38","v":0.39900000000000002},0.39900000000000002,{"$f":"N38","v":0.39900000000000002},{"$f":"0.399","v":0.39900000000000002},{"$f":"N38","v":0.39900000000000002},0.39900000000000002,0.39900000000000002]
[null,"VSDF biudžeto semi-elastingumas pot. BVP","εVSDF","Semi-elasticity of the SSIF budget to the OG","εSSIF",{"$f":"F26","v":"2019-10-28"},{"$f":"H39","v":0.10056532721961585},{"$f":"I39","v":0.10056532721961585},0.10056532721961585,0.10056532721961585,0.10056532721961585,{"$f":"M39","v":0.10056532721961585},0.10056532721961585,{"$f":"M39","v":0.10056532721961585},{"$f":"N39","v":0.10056532721961585},{"$f":"N39","v":0.10056532721961585},{"$f":"N39","v":0.10056532721961585}]
[null,"PSDF biudžeto semi-elastingumas pot. BVP","εPSDF","Semi-elasticity of the NHIF budget to the OG","εNHIF",{"$f":"F26","v":"2019-10-28"},null,null,null,null,null,null,null,4.5352990706885581E-2,{"$f":"N40","v":4.5352990706885581E-2},{"$f":"N40","v":4.5352990706885581E-2},{"$f":"N40","v":4.5352990706885581E-2}]
[]
[null,null,"Šaltiniai:",null,"Sources:"]
[null,null,"Europos Komisija, Eurostatas, Lietuvos statistikos departamentas",null,"European Commission, Eurostat, Statistics Lithuania"]
[null,"2019 rudens ERS duomenys","Finansų ministerija (FM)","2018 spring EDS data","Ministry of Finance (MoF)"]
[null,null,"Fiskalinės institucijos skaičiavimai",null,"Independent fiscal institution calculations"]
[null,null,"ERS – ekonominės raidos scenarijus",null,"EDS – economic development scenario"]
[null,null,"Dėmesio: langeliai su formulėmis, atnaujinami tik spalvoti langeliai",null,"Warning: cells with formulas, data inputs are marked with coloured cells"]
[null,null,"Apvalinimo tikslumas",null,"Rounding threshold",4.9999999999999899E-2]

{"sheet":"3. GGbudget","index":4,"n_rows":29,"n_cols":13,"rows_kept":29,"cut":false,"hidden":false,"merged":[[3,2,4,2],[2,1,2,2],[3,1,4,1],[3,3,4,3],[3,5,3,6],[3,7,3,8],[3,9,3,10],[3,11,3,12],[0,3,0,4],[3,4,4,4],[2,3,2,4]]}
[null,"↖ atgal į turinį",null,"↖ back to content"]
[{"$f":"Kalba","v":"LT"}]
[null,"3 lentelė.    VS fiskaliniai rodikliai",null,"Table 3. GG fiscal indicators"]
[null,"Rodiklis","Žymėjimas | Formulė    ","Indicator","   Notation | Formula",{"$f":"IF($A$2=\"LT\",\"proc. BVP\",\"% of GDP\")","v":"proc. BVP"},null,{"$f":"IF($A$2=\"LT\",\"mln. EUR\", \"mil. EUR\")","v":"mln. EUR"},null,{"$f":"IF($A$2=\"LT\",\"proc. BVP\",\"% of GDP\")","v":"proc. BVP"},null,{"$f":"IF($A$2=\"LT\",\"mln. EUR\", \"mil. EUR\")","v":"mln. EUR"}]
[null,null,null,null,null,{"$f":"'2. Macro'!N5","v":"2019P"},{"$f":"'2. Macro'!O5","v":"2020P"},{"$f":"F5","v":"2019P"},"2020P","2019P","2020P","2019P","2020P"]
[null,"Nominalus BVP, mln. EUR",null,"Nominal GDP, million EUR",null,null,null,{"$f":"'2. Macro'!N8","v":48333.108783344796},{"$f":"'2. Macro'!O8","v":50862.337498625369},null,null,{"$f":"'2. Macro'!N7","v":48494.418850914291},{"$f":"'2. Macro'!O7","v":51032.088778962476}]
[null,"Grynasis skolinimas (+) / grynasis skolinimasis (-), iš jo","B=VP–VI","Net lending (+) /net borrowing (-), of which","B=TR–TE",{"$f":"F10-F11","v":5.6276123520063948E-2},{"$f":"G10-G11","v":0.20781585196090901},{"$f":"H10-H11","v":27.200000000000728},{"$f":"I10-I11","v":105.70000000000073},{"$f":"J10-J11","v":1.109031846104358E-2},{"$f":"K10-K11","v":-0.21037611713292392},{"$f":"L10-L11","v":5.3781854863991612},{"$f":"M10-M11","v":-107.3593268650111}]
[null,"Valstybinis socialinio draudimo fondas","VSDF","State Social Insurance Fund","SSIF",{"$f":"H8/H6*100","v":0.81229825658408694},{"$f":"I8/I6*100","v":0.68276256475508124},392.60899999999998,347.26900000000001,{"$f":"L8/L6*100","v":0.71304387843691219},{"$f":"M8/M6*100","v":0.57161857009150152},345.78648500000031,291.7088961661309]
[null,"Privalomojo sveikatos draudimo fondas","PSDF","National Health Insurance Fund","NHIF",{"$f":"H9/H6*100","v":0.21724238858846623},{"$f":"I9/I6*100","v":0.39479113598628279},105,200.80000000000018,{"$f":"L9/L6*100","v":0.21651976142409302},{"$f":"M9/M6*100","v":0.39347791713902608},105,200.80000000000018]
[null,"Visos pajamos","VP","Total revenues","TR",{"$f":"H10/H6*100","v":35.453337125098869},{"$f":"I10/I6*100","v":36.67055215561826},17135.7,18651.5,{"$f":"L10/L6*100","v":34.512423648014732},{"$f":"M10/M6*100","v":35.621110104706801},16736.599279470258,18178.196532685946]
[null,"Visos išlaidos, iš jų","VI","Total expenditures, of which","TE",{"$f":"H11/H6*100","v":35.397061001578805},{"$f":"I11/I6*100","v":36.462736303657351},17108.5,18545.8,{"$f":"L11/L6*100","v":34.501333329553688},{"$f":"M11/M6*100","v":35.831486221839725},16731.221093983859,18285.555859550957]
[null,"Centrinė valdžia, be pervedimų SAF","CV","Central government, net of transfers to SSF","CG",{"$f":"H12/H6*100","v":19.626298077620863},{"$f":"I12/I6*100","v":20.315621554513228},9486,10333,{"$f":"L12/L6*100","v":19.39342282488856},{"$f":"M12/M6*100","v":20.419001481859102},9404.7276942302742,10420.242964000001]
[null,"Socialinės apsaugos fondai, be pervedimų CV","SAF","Social Security Funds, net of transfers to CG","SSF",{"$f":"H13/H6*100","v":11.57591584907113},{"$f":"I13/I6*100","v":11.806378344609691},5595,6005,{"$f":"L13/L6*100","v":12.647775352986548},{"$f":"M13/M6*100","v":12.884420612831729},6133.4651549999999,6575.1889657952297]
[null,"Konsoliduotos išlaidos VS posektorių, kurių išlaidos > 3 proc. BVP","AV3=CV+SAF","Consolidated expenditure of GG subsectors with exp.    >  3 % of GDP","AG3=CG+SSF",{"$f":"H14/H6*100","v":31.202213926691989},{"$f":"I14/I6*100","v":32.121999899122919},{"$f":"H12+H13","v":15081},{"$f":"I12+I13","v":16338},{"$f":"SUM(J12:J13)","v":32.04119817787511},{"$f":"SUM(K12:K13)","v":33.303422094690831},{"$f":"L12+L13","v":15538.192849230274},{"$f":"M12+M13","v":16995.431929795232}]
[null,"Vienkartinės ir kitos laikinosios priemonės","1klp","One-off and temporary measures","1off",6.3103741447125911E-2,5.7016648125508915E-3,{"$f":"F15*H6/100","v":30.500000000000004},{"$f":"G15*I6/100","v":2.9},{"$f":"L15/$L$6*100","v":6.2893835461284159E-2},{"$f":"M15/$M$6*100","v":5.6826990025058491E-3},{"$f":"H15","v":30.500000000000004},2.9]
[null,"Vienkartinės ir kitos laikinosios priemonės, VSDF","1klpVSDF","One-off and temporary measures, SSIF","1offSSIF",{"$f":"H16/$H$6*100","v":0},{"$f":"I16/I6*100","v":0},0,0,{"$f":"L16/$L$6*100","v":0},{"$f":"M16/$M$6*100","v":0},0,0]
[null,"Vienkartinės ir kitos laikinosios priemonės, PSDF","1klpPSDF","One-off and temporary measures, NHIF","1offNHIF",{"$f":"H17/$H$6*100","v":0},{"$f":"I17/I7*100","v":0},0,0,{"$f":"L17/$L$6*100","v":0},{"$f":"M17/$M$6*100","v":0},0,0]
[null,"Lankstumo galimybė dėl vykdomų struktūrinių reformų","SR","Structural reform flexibility clause","SR",0.5,0,null,null,0.5,0]
[null,"Struktūrinis VS balansas","SB = B–CB–1klp","Structural GG balance","SB = B–CB–1off",{"$f":"F7-F15-'2. Macro'!N22","v":-1.4232501955509695},{"$f":"G7-G15-'2. Macro'!O22","v":-0.67575981292697307},null,null,{"$f":"J7-J15-'2. Macro'!N21","v":-1.427278906839808},{"$f":"K7-K15-'2. Macro'!O21","v":-1.3042547704636034}]
[null,"Struktūrinis VSDF balansas","SBVSDF = VSDF– CBVSDF–1klpVSDF","Structural SSIF balance","SBSSIF = SSIF– CBSSIF–1offSSIF",{"$f":"F8-F16-'2. Macro'!N24","v":0.45529825658408696},{"$f":"G8-G16-'2. Macro'!O24","v":0.46150019363937012},null,null,{"$f":"J8-J16-'2. Macro'!N23","v":0.36636434795634892},{"$f":"K8-K16-'2. Macro'!O23","v":0.29734593293341899}]
[null,"Struktūrinis PSDF balansas","SBPSDF = PSDF– CBPSDF–1klpPSDF","Structural NHIF balance","SBNHIF = NHIF– CBNHIF–1offNHIF",{"$f":"F9-F17-'2. Macro'!N26","v":5.6242388588466224E-2},{"$f":"G9-G17-'2. Macro'!O26","v":0.29500614509096207},null,null,{"$f":"J9-J17-'2. Macro'!N25","v":6.0174090815211523E-2},{"$f":"K9-K17-'2. Macro'!O25","v":0.26978633567557708}]
[null,"Vidutinio laikotarpio tikslas","VLT","Medium-term objective","MTO",-1,-1,null,null,{"$f":"F22","v":-1},{"$f":"G22","v":-1}]
[null,"Struktūrinio postūmio užduotis","SPU","Structural adjustment target","SAT",0,0,null,null,{"$f":"F23","v":0},{"$f":"G23","v":0}]
[]
[null,null,"Šaltiniai:",null,"Sources:"]
[null,null,"Finansų ministerija, VSDF, PSDF",null,"Ministry of Finance, SSIF, NHIF"]
[null,null,"Fiskalinės institucijos skaičiavimai",null,"Independent fiscal institution calculations"]
[]
[null,null,"Dėmesio: langeliai su formulėmis, atnaujinami tik spalvoti langeliai",null,"Warning: cells with formulas, data inputs are marked with coloured cells"]

{"sheet":"4. Municipalities","index":5,"n_rows":72,"n_cols":27,"rows_kept":72,"cut":false,"hidden":true,"merged":[[1,1,1,3],[0,1,0,2],[2,1,3,1],[2,2,3,2],[2,3,3,3],[2,16,2,17],[65,7,65,8],[70,7,70,8],[71,7,71,8],[2,14,2,15],[2,12,2,13],[2,10,2,11],[2,5,3,5],[1,4,1,6],[2,4,3,4],[2,6,3,6],[2,8,2,9],[2,7,3,7]]}
[null,"↖ back to content",null,null,"↖ atgal į turinį"]
[{"$f":"Kalba","v":"LT"},"Table 4. Budget attributable to local government",null,null,"4 lentelė. Vietos valdžios biudžetai"]
[null,"Local government","Appropriations, \n% of GDP","Code","Savivaldybė","Asignavimai, proc. BVP","Kodas","εi",{"$f":"IF(A2=\"LT\",\"Pajamos\",\"Revenues\")","v":"Pajamos"},null,{"$f":"IF(A2=\"LT\",\"Išlaidos\",\"Expenditures\")","v":"Išlaidos"},null,{"$f":"IF(A2=\"LT\",\"Balansas\",\"Balance\")","v":"Balansas"},null,{"$f":"IF($A$2=\"LT\",\"Fiskalinė taisyklė, planavimas\", \"Fiscal rule, plan\")","v":"Fiskalinė taisyklė, planavimas"},null,{"$f":"IF($A$2=\"LT\",\"Fiskalinė taisyklė, vykdymas\", \"Fiscal rule, implementation\")","v":"Fiskalinė taisyklė, vykdymas"}]
[null,null,null,null,null,null,null,null,{"$f":"IF($A$2=\"LT\",\"Planavimas\",\"Plan\")","v":"Planavimas"},{"$f":"IF($A$2=\"LT\",\"Vykdymas\",\"Implementation\")","v":"Vykdymas"},{"$f":"I4","v":"Planavimas"},{"$f":"J4","v":"Vykdymas"},{"$f":"K4","v":"Planavimas"},{"$f":"L4","v":"Vykdymas"},"FM","IFI","FM","IFI",null,{"$f":"\"\"","v":""},{"$f":"\"\"","v":""},{"$f":"\"\"","v":""},{"$f":"\"\"","v":""},{"$f":"\"\"","v":""},{"$f":"\"\"","v":""},{"$f":"\"\"","v":""},{"$f":"\"\"","v":""}]
[null,"Vilniaus m.",{"$f":"K5/$H$67/10","v":1.5491303400216081},1,"Vilniaus m.",{"$f":"K5/$H$68/10","v":1.1942546517903803},1,{"$f":"IF(F5>0.3, K5/'3. GGbudget'!$I$11/1000*'2. Macro'!$N$38,0)","v":1.241849581037216E-2},559989.4,587979.80000000005,577220.4,546819.69999999995,{"$f":"I5-K5","v":-17231},{"$f":"J5-L5","v":41160.100000000093},{"$f":"IF(H5>0,IF(M5/$H$67/10-H5*$H$69<-eps,1,0),IF(($H$69+eps>=0)*(M5<0),1,IF(($H$69+eps<0)*(K5/I5>1.015),1,0)))","v":1},{"$f":"IF(H5>0,IF(M5/$I$67/10-H5*$I$69<-eps,1,0),IF(($I$69+eps>=0)*(M5<0),1,IF(($I$69+eps<0)*(K5/I5>1.015),1,0)))","v":1},{"$f":"IF(H5>0,IF(N5/$H$68/10-H5*$H$69<-eps,1,0),IF(($H$69+eps>=0)*(N5<0),1,IF(($H$69+eps<0)*(L5/J5>1.015),1,0)))","v":0},{"$f":"IF(H5>0,IF(N5/$I$68/10-H5*$I$69<-eps,1,0),IF(($I$69+eps>=0)*(N5<0),1,IF(($I$69+eps<0)*(L5/J5>1.015),1,0)))","v":0},null,{"$f":"CONCATENATE(T4,IF((H5>0)*(O5=1),CONCATENATE(E5,\" \"),\"\"))","v":"Vilniaus m. "},{"$f":"CONCATENATE(U4,IF((H5=0)*(O5=1),CONCATENATE(E5,\" \"),\"\"))","v":""},{"$f":"CONCATENATE(V4,IF((H5>0)*(P5=1),CONCATENATE(E5,\" \"),\"\"))","v":"Vilniaus m. "},{"$f":"CONCATENATE(W4,IF((H5=0)*(P5=1),CONCATENATE(E5,\" \"),\"\"))","v":""},{"$f":"CONCATENATE(X4,IF((H5>0)*(Q5=1),CONCATENATE(E5,\" \"),\"\"))","v":""},{"$f":"CONCATENATE(Y4,IF((H5=0)*(Q5=1),CONCATENATE(E5,\" \"),\"\"))","v":""},{"$f":"CONCATENATE(Z4,IF((H5>0)*(R5=1),CONCATENATE(E5,\" \"),\"\"))","v":""},{"$f":"CONCATENATE(AA4,IF((H5=0)*(R5=1),CONCATENATE(E5,\" \"),\"\"))","v":""}]
[null,"Alytaus m.",0.14711655694941567,2,"Alytaus m.",{"$f":"K6/$H$68/10","v":0.11341500966908527},2,{"$f":"IF(F6>0.3, K6/'3. GGbudget'!$I$11/1000*'2. Macro'!$N$38,0)","v":0},49115,59218.1,54817,51667.5,-5702,7550.5999999999985,{"$f":"IF(H6>0,IF(M6/$H$67/10-H6*$H$69<-eps,1,0),IF(($H$69+eps>=0)*(M6<0),1,IF(($H$69+eps<0)*(K6/I6>1.015),1,0)))","v":1},1,{"$f":"IF(H6>0,IF(N6/$H$68/10-H6*$H$69<-eps,1,0),IF(($H$69+eps>=0)*(N6<0),1,IF(($H$69+eps<0)*(L6/J6>1.015),1,0)))","v":0},{"$f":"IF(H6>0,IF(N6/$I$68/10-H6*$I$69<-eps,1,0),IF(($I$69+eps>=0)*(N6<0),1,IF(($I$69+eps<0)*(L6/J6>1.015),1,0)))","v":0},null,{"$f":"CONCATENATE(T5,IF((H6>0)*(O6=1),CONCATENATE(E6,\" \"),\"\"))","v":"Vilniaus m. "},{"$f":"CONCATENATE(U5,IF((H6=0)*(O6=1),CONCATENATE(E6,\" \"),\"\"))","v":"Alytaus m. "},{"$f":"CONCATENATE(V5,IF((H6>0)*(P6=1),CONCATENATE(E6,\" \"),\"\"))","v":"Vilniaus m. "},{"$f":"CONCATENATE(W5,IF((H6=0)*(P6=1),CONCATENATE(E6,\" \"),\"\"))","v":"Alytaus m. "},{"$f":"CONCATENATE(X5,IF((H6>0)*(Q6=1),CONCATENATE(E6,\" \"),\"\"))","v":""},{"$f":"CONCATENATE(Y5,IF((H6=0)*(Q6=1),CONCATENATE(E6,\" \"),\"\"))","v":""},{"$f":"CONCATENATE(Z5,IF((H6>0)*(R6=1),CONCATENATE(E6,\" \"),\"\"))","v":""},{"$f":"CONCATENATE(AA5,IF((H6=0)*(R6=1),CONCATENATE(E6,\" \"),\"\"))","v":""}]
[null,"Birštono m.",2.2842155526713735E-2,3,"Birštono m.",1.7609461121468131E-2,3,{"$f":"IF(F7>0.3, K7/'3. GGbudget'!$I$11/1000*'2. Macro'!$N$38,0)","v":0},8517.7000000000007,8679.6,8511.2000000000007,8096.9,6.5,582.70000000000073,0,0,0,0,null,"Vilniaus m. ","Alytaus m. ","Vilniaus m. ","Alytaus m. ","","","",""]
[null,"Druskininkų m.",6.1421437613435922E-2,4,"Druskininkų m.",4.7350978606793867E-2,4,{"$f":"IF(F8>0.3, K8/'3. GGbudget'!$I$11/1000*'2. Macro'!$N$38,0)","v":0},22174.400000000001,23007.599999999999,22886.2,21486.799999999999,-711.79999999999927,1520.7999999999993,{"$f":"IF(H8>0,IF(M8/$H$67/10-H8*$H$69<-eps,1,0),IF(($H$69+eps>=0)*(M8<0),1,IF(($H$69+eps<0)*(K8/I8>1.015),1,0)))","v":1},1,0,0,null,"Vilniaus m. ","Alytaus m. Druskininkų m. ","Vilniaus m. ","Alytaus m. Druskininkų m. ","","","",""]
[null,"Kauno m.",0.8621410796693143,5,"Kauno m.",0.66464129472817468,5,{"$f":"IF(F9>0.3, K9/'3. GGbudget'!$I$11/1000*'2. Macro'!$N$38,0)","v":6.9112941043255076E-3},321241.8,320978.59999999998,321241.8,292694,0,28284.599999999977,0,0,0,0,null,"Vilniaus m. ","Alytaus m. Druskininkų m. ","Vilniaus m. ","Alytaus m. Druskininkų m. ","","","",""]
[null,"Klaipėdos m.",0.50477025331221514,6,"Klaipėdos m.",0.38913718718795015,6,{"$f":"IF(F10>0.3, K10/'3. GGbudget'!$I$11/1000*'2. Macro'!$N$38,0)","v":4.0464556880803202E-3},191141.8,195975.3,188082.1,169971.5,3059.6999999999825,26003.799999999988,0,0,0,0,null,"Vilniaus m. ","Alytaus m. Druskininkų m. ","Vilniaus m. ","Alytaus m. Druskininkų m. ","","","",""]
[null,"Marijampolės m.",0.15965891638622176,7,"Marijampolės m.",0.12308415803888847,7,{"$f":"IF(F11>0.3, K11/'3. GGbudget'!$I$11/1000*'2. Macro'!$N$38,0)","v":0},59490.400000000001,59337.4,59490.400000000001,58823,0,514.40000000000146,0,0,0,0,null,"Vilniaus m. ","Alytaus m. Druskininkų m. ","Vilniaus m. ","Alytaus m. Druskininkų m. ","","","",""]
[null,"Neringos m.",3.1161861576719907E-2,8,"Neringos m.",2.4023284022651421E-2,8,{"$f":"IF(F12>0.3, K12/'3. GGbudget'!$I$11/1000*'2. Macro'!$N$38,0)","v":0},11611.2,12023,11611.2,10369.200000000001,0,1653.7999999999993,0,0,0,0,null,"Vilniaus m. ","Alytaus m. Druskininkų m. ","Vilniaus m. ","Alytaus m. Druskininkų m. ","","","",""]
[null,"Palangos m.",7.1096718994364067E-2,9,"Palangos m.",5.4809840845844136E-2,9,{"$f":"IF(F13>0.3, K13/'3. GGbudget'!$I$11/1000*'2. Macro'!$N$38,0)","v":0},27105.7,27576.400000000001,26491.3,25205,614.40000000000146,2371.4000000000015,0,0,0,0,null,"Vilniaus m. ","Alytaus m. Druskininkų m. ","Vilniaus m. ","Alytaus m. Druskininkų m. ","","","",""]
[null,"Panevėžio m.",0.20936003519611507,10,"Panevėžio m.",0.16139971535801861,10,{"$f":"IF(F14>0.3, K14/'3. GGbudget'!$I$11/1000*'2. Macro'!$N$38,0)","v":0},83380.100000000006,82619.7,78009.5,78496.899999999994,5370.6000000000058,4122.8000000000029,0,0,0,0,null,"Vilniaus m. ","Alytaus m. Druskininkų m. ","Vilniaus m. ","Alytaus m. Druskininkų m. ","","","",""]
[null,"Šiaulių m.",0.29833902302331661,11,"Šiaulių m.",0.22999534438866095,11,{"$f":"IF(F15>0.3, K15/'3. GGbudget'!$I$11/1000*'2. Macro'!$N$38,0)","v":0},113796.2,114535.3,111163.9,97994.2,2632.3000000000029,16541.100000000006,0,0,0,0,null,"Vilniaus m. ","Alytaus m. Druskininkų m. ","Vilniaus m. ","Alytaus m. Druskininkų m. ","","","",""]
[null,"Visagino m.",5.8144278562577034E-2,12,"Visagino m.",4.4824553076266468E-2,12,{"$f":"IF(F16>0.3, K16/'3. GGbudget'!$I$11/1000*'2. Macro'!$N$38,0)","v":0},22001.599999999999,22324.7,21665.1,19705,336.5,2619.7000000000007,0,0,0,0,null,"Vilniaus m. ","Alytaus m. Druskininkų m. ","Vilniaus m. ","Alytaus m. Druskininkų m. ","","","",""]
[null,"Akmenės raj.",7.2585141244471629E-2,13,"Akmenės raj.",5.5957294452617136E-2,13,{"$f":"IF(F17>0.3, K17/'3. GGbudget'!$I$11/1000*'2. Macro'!$N$38,0)","v":0},27045.9,27433.3,27045.9,24110.2,0,3323.0999999999985,0,0,0,0,null,"Vilniaus m. ","Alytaus m. Druskininkų m. ","Vilniaus m. ","Alytaus m. Druskininkų m. ","","","",""]
[null,"Alytaus raj.",5.7676764758089596E-2,14,"Alytaus raj.",4.4464137608722559E-2,14,{"$f":"IF(F18>0.3, K18/'3. GGbudget'!$I$11/1000*'2. Macro'!$N$38,0)","v":0},24665.200000000001,25690.5,21490.9,19221.400000000001,3174.2999999999993,6469.0999999999985,0,0,{"$f":"IF(H18>0,IF(N18/$H$68/10-H18*$H$69<-eps,1,0),IF(($H$69+eps>=0)*(N18<0),1,IF(($H$69+eps<0)*(L18/J18>1.015),1,0)))","v":0},{"$f":"IF(H18>0,IF(N18/$I$68/10-H18*$I$69<-eps,1,0),IF(($I$69+eps>=0)*(N18<0),1,IF(($I$69+eps<0)*(L18/J18>1.015),1,0)))","v":0},null,"Vilniaus m. ","Alytaus m. Druskininkų m. ","Vilniaus m. ","Alytaus m. Druskininkų m. ","","","",""]
[null,"Anykščių raj.",7.3854030605904827E-2,15,"Anykščių raj.",5.6935505893804049E-2,15,{"$f":"IF(F19>0.3, K19/'3. GGbudget'!$I$11/1000*'2. Macro'!$N$38,0)","v":0},27518.7,28085.200000000001,27518.7,26058.400000000001,0,2026.7999999999993,0,0,0,0,null,"Vilniaus m. ","Alytaus m. Druskininkų m. ","Vilniaus m. ","Alytaus m. Druskininkų m. ","","","",""]
[null,"Biržų raj.",6.3696206274076322E-2,16,"Biržų raj.",4.9104641926485136E-2,16,{"$f":"IF(F20>0.3, K20/'3. GGbudget'!$I$11/1000*'2. Macro'!$N$38,0)","v":0},23733.8,24028,23733.8,23132.6,0,895.40000000000146,0,0,0,0,null,"Vilniaus m. ","Alytaus m. Druskininkų m. ","Vilniaus m. ","Alytaus m. Druskininkų m. ","","","",""]
[null,"Ignalinos raj.",4.9444549810415739E-2,17,"Ignalinos raj.",3.8117763296758166E-2,17,{"$f":"IF(F21>0.3, K21/'3. GGbudget'!$I$11/1000*'2. Macro'!$N$38,0)","v":0},18423.5,18753.900000000001,18423.5,17555.2,0,1198.7000000000007,0,0,0,0,null,"Vilniaus m. ","Alytaus m. Druskininkų m. ","Vilniaus m. ","Alytaus m. Druskininkų m. ","","","",""]
[null,"Jonavos raj.",0.12285951463897185,18,"Jonavos raj.",9.4714784859390083E-2,18,{"$f":"IF(F22>0.3, K22/'3. GGbudget'!$I$11/1000*'2. Macro'!$N$38,0)","v":0},46867.5,46776.6,45778.6,41451.9,1088.9000000000015,5324.6999999999971,0,0,0,0,null,"Vilniaus m. ","Alytaus m. Druskininkų m. ","Vilniaus m. ","Alytaus m. Druskininkų m. ","","","",""]
[null,"Joniškio raj.",6.4111118066118564E-2,19,"Joniškio raj.",4.9424505481492541E-2,19,{"$f":"IF(F23>0.3, K23/'3. GGbudget'!$I$11/1000*'2. Macro'!$N$38,0)","v":0},23888.400000000001,24133.7,23888.400000000001,23432.1,0,701.60000000000218,0,0,0,0,null,"Vilniaus m. ","Alytaus m. Druskininkų m. ","Vilniaus m. ","Alytaus m. Druskininkų m. ","","","",""]
[null,"Jurbarko raj.",7.1056462352186628E-2,20,"Jurbarko raj.",5.477880621890293E-2,20,{"$f":"IF(F24>0.3, K24/'3. GGbudget'!$I$11/1000*'2. Macro'!$N$38,0)","v":0},26476.3,26516.7,26476.3,25097,0,1419.7000000000007,0,0,0,0,null,"Vilniaus m. ","Alytaus m. Druskininkų m. ","Vilniaus m. ","Alytaus m. Druskininkų m. ","","","",""]
[null,"Kaišiadorių raj.",7.7105962160999172E-2,21,"Kaišiadorių raj.",5.9442483058114962E-2,21,{"$f":"IF(F25>0.3, K25/'3. GGbudget'!$I$11/1000*'2. Macro'!$N$38,0)","v":0},31073.7,29913.599999999999,28730.400000000001,26162.2,2343.2999999999993,3751.3999999999978,0,0,0,0,null,"Vilniaus m. ","Alytaus m. Druskininkų m. ","Vilniaus m. ","Alytaus m. Druskininkų m. ","","","",""]
[null,"Kauno raj.",0.19439073699123785,22,"Kauno raj.",0.14985959277868638,22,{"$f":"IF(F26>0.3, K26/'3. GGbudget'!$I$11/1000*'2. Macro'!$N$38,0)","v":0},73871.5,72224.2,72431.8,69139.5,1439.6999999999971,3084.6999999999971,0,0,0,0,null,"Vilniaus m. ","Alytaus m. Druskininkų m. ","Vilniaus m. ","Alytaus m. Druskininkų m. ","","","",""]
[null,"Kėdainių raj.",0.13459969338598862,23,"Kėdainių raj.",0.10376551656301147,23,{"$f":"IF(F27>0.3, K27/'3. GGbudget'!$I$11/1000*'2. Macro'!$N$38,0)","v":0},50153.1,52993.3,50153.1,47284.9,0,5708.4000000000015,0,0,0,0,null,"Vilniaus m. ","Alytaus m. Druskininkų m. ","Vilniaus m. ","Alytaus m. Druskininkų m. ","","","",""]
[null,"Kelmės raj.",8.5978257719294474E-2,24,"Kelmės raj.",6.6282307938444571E-2,24,{"$f":"IF(F28>0.3, K28/'3. GGbudget'!$I$11/1000*'2. Macro'!$N$38,0)","v":0},32036.3,30528.7,32036.3,29428.5,0,1100.2000000000007,0,0,0,0,null,"Vilniaus m. ","Alytaus m. Druskininkų m. ","Vilniaus m. ","Alytaus m. Druskininkų m. ","","","",""]
[null,"Klaipėdos raj.",0.1259879924913887,25,"Klaipėdos raj.",9.7126589167747954E-2,25,{"$f":"IF(F29>0.3, K29/'3. GGbudget'!$I$11/1000*'2. Macro'!$N$38,0)","v":0},47423.4,46245.1,46944.3,45315.1,479.09999999999854,930,0,0,0,0,null,"Vilniaus m. ","Alytaus m. Druskininkų m. ","Vilniaus m. ","Alytaus m. Druskininkų m. ","","","",""]
[null,"Kretingos raj.",0.10281358547790376,26,"Kretingos raj.",7.9260988925258374E-2,26,{"$f":"IF(F30>0.3, K30/'3. GGbudget'!$I$11/1000*'2. Macro'!$N$38,0)","v":0},38358.400000000001,37808.199999999997,38309.300000000003,36224.400000000001,49.099999999998545,1583.7999999999956,0,0,0,0,null,"Vilniaus m. ","Alytaus m. Druskininkų m. ","Vilniaus m. ","Alytaus m. Druskininkų m. ","","","",""]
[null,"Kupiškio raj.",6.1007867709466257E-2,27,"Kupiškio raj.",4.703214953935117E-2,27,{"$f":"IF(F31>0.3, K31/'3. GGbudget'!$I$11/1000*'2. Macro'!$N$38,0)","v":0},22898.1,23403.3,22732.1,22063.5,166,1339.7999999999993,0,0,0,0,null,"Vilniaus m. ","Alytaus m. Druskininkų m. ","Vilniaus m. ","Alytaus m. Druskininkų m. ","","","",""]
[null,"Lazdijų raj.",5.8036122383926955E-2,28,"Lazdijų raj.",4.4741173378551088E-2,28,{"$f":"IF(F32>0.3, K32/'3. GGbudget'!$I$11/1000*'2. Macro'!$N$38,0)","v":0},21624.799999999999,22132.400000000001,21624.799999999999,20225.5,0,1906.9000000000015,0,0,0,0,null,"Vilniaus m. ","Alytaus m. Druskininkų m. ","Vilniaus m. ","Alytaus m. Druskininkų m. ","","","",""]
[null,"Mažeikių raj.",0.14553393415661289,30,"Mažeikių raj.",0.11219493503526985,30,{"$f":"IF(F33>0.3, K33/'3. GGbudget'!$I$11/1000*'2. Macro'!$N$38,0)","v":0},54227.3,52534.7,54227.3,51246.6,0,1288.0999999999985,0,0,0,0,null,"Vilniaus m. ","Alytaus m. Druskininkų m. ","Vilniaus m. ","Alytaus m. Druskininkų m. ","","","",""]
[null,"Molėtų raj.",4.9851678651637012E-2,31,"Molėtų raj.",3.8431626823890265E-2,31,{"$f":"IF(F34>0.3, K34/'3. GGbudget'!$I$11/1000*'2. Macro'!$N$38,0)","v":0},18575.2,19023.5,18575.2,18245.599999999999,0,777.90000000000146,0,0,0,0,null,"Vilniaus m. ","Alytaus m. Druskininkų m. ","Vilniaus m. ","Alytaus m. Druskininkų m. ","","","",""]
[null,"Pakruojo raj.",5.7015213938306844E-2,32,"Pakruojo raj.",4.3954135239322019E-2,32,{"$f":"IF(F35>0.3, K35/'3. GGbudget'!$I$11/1000*'2. Macro'!$N$38,0)","v":0},21244.400000000001,20687.2,21244.400000000001,20078.900000000001,0,608.29999999999927,0,0,0,0,null,"Vilniaus m. ","Alytaus m. Druskininkų m. ","Vilniaus m. ","Alytaus m. Druskininkų m. ","","","",""]
[null,"Panevėžio raj.",8.2867761167050219E-2,33,"Panevėžio raj.",6.3884365763453785E-2,33,{"$f":"IF(F36>0.3, K36/'3. GGbudget'!$I$11/1000*'2. Macro'!$N$38,0)","v":0},28639.599999999999,32231.3,30877.3,29335.1,-2237.7000000000007,2896.2000000000007,1,1,0,0,null,"Vilniaus m. ","Alytaus m. Druskininkų m. Panevėžio raj. ","Vilniaus m. ","Alytaus m. Druskininkų m. Panevėžio raj. ","","","",""]
[null,"Pasvalio raj.",{"$f":"K37/$H$67/10","v":6.9543349361543563E-2},34,"Pasvalio raj.",5.3612318040939341E-2,34,{"$f":"IF(F37>0.3, K37/'3. GGbudget'!$I$11/1000*'2. Macro'!$N$38,0)","v":0},25912.5,25886.9,25912.5,25543.7,{"$f":"I37-K37","v":0},{"$f":"J37-L37","v":343.20000000000073},{"$f":"IF(H37>0,IF(M37/$H$67/10-H37*$H$69<-eps,1,0),IF(($H$69+eps>=0)*(M37<0),1,IF(($H$69+eps<0)*(K37/I37>1.015),1,0)))","v":0},{"$f":"IF(H37>0,IF(M37/$I$67/10-H37*$I$69<-eps,1,0),IF(($I$69+eps>=0)*(M37<0),1,IF(($I$69+eps<0)*(K37/I37>1.015),1,0)))","v":0},{"$f":"IF(H37>0,IF(N37/$H$68/10-H37*$H$69<-eps,1,0),IF(($H$69+eps>=0)*(N37<0),1,IF(($H$69+eps<0)*(L37/J37>1.015),1,0)))","v":0},{"$f":"IF(H37>0,IF(N37/$I$68/10-H37*$I$69<-eps,1,0),IF(($I$69+eps>=0)*(N37<0),1,IF(($I$69+eps<0)*(L37/J37>1.015),1,0)))","v":0},null,"Vilniaus m. ","Alytaus m. Druskininkų m. Panevėžio raj. ","Vilniaus m. ","Alytaus m. Druskininkų m. Panevėžio raj. ","","","",""]
[null,"Plungės raj.",9.2245948528708793E-2,35,"Plungės raj.",7.1114192455677933E-2,35,{"$f":"IF(F38>0.3, K38/'3. GGbudget'!$I$11/1000*'2. Macro'!$N$38,0)","v":0},34371.699999999997,34281.4,34371.699999999997,33241.800000000003,0,1039.5999999999985,0,0,0,0,null,"Vilniaus m. ","Alytaus m. Druskininkų m. Panevėžio raj. ","Vilniaus m. ","Alytaus m. Druskininkų m. Panevėžio raj. ","","","",""]
[null,"Prienų raj.",6.9248133985575597E-2,36,"Prienų raj.",5.3384730776703804E-2,36,{"$f":"IF(F39>0.3, K39/'3. GGbudget'!$I$11/1000*'2. Macro'!$N$38,0)","v":0},25802.5,26213.5,25802.5,25243.9,0,969.59999999999854,0,0,0,0,null,"Vilniaus m. ","Alytaus m. Druskininkų m. Panevėžio raj. ","Vilniaus m. ","Alytaus m. Druskininkų m. Panevėžio raj. ","","","",""]
[null,"Radviliškio raj.",0.10887623578982761,37,"Radviliškio raj.",8.3934803742604522E-2,37,{"$f":"IF(F40>0.3, K40/'3. GGbudget'!$I$11/1000*'2. Macro'!$N$38,0)","v":0},40568.300000000003,41333.4,40568.300000000003,37009.5,0,4323.9000000000015,0,0,0,0,null,"Vilniaus m. ","Alytaus m. Druskininkų m. Panevėžio raj. ","Vilniaus m. ","Alytaus m. Druskininkų m. Panevėžio raj. ","","","",""]
[null,"Raseinių raj.",9.1899741405982727E-2,38,"Raseinių raj.",7.084729466398354E-2,38,{"$f":"IF(F41>0.3, K41/'3. GGbudget'!$I$11/1000*'2. Macro'!$N$38,0)","v":0},34983.4,35149.199999999997,34242.699999999997,33395.800000000003,740.70000000000437,1753.3999999999942,0,0,0,0,null,"Vilniaus m. ","Alytaus m. Druskininkų m. Panevėžio raj. ","Vilniaus m. ","Alytaus m. Druskininkų m. Panevėžio raj. ","","","",""]
[null,"Rokiškio raj.",8.0590308730264668E-2,39,"Rokiškio raj.",6.21286334686331E-2,39,{"$f":"IF(F42>0.3, K42/'3. GGbudget'!$I$11/1000*'2. Macro'!$N$38,0)","v":0},30028.7,30399.5,30028.7,29688.400000000001,0,711.09999999999854,0,0,0,0,null,"Vilniaus m. ","Alytaus m. Druskininkų m. Panevėžio raj. ","Vilniaus m. ","Alytaus m. Druskininkų m. Panevėžio raj. ","","","",""]
[null,"Skuodo r.",4.5506913450232167E-2,40,"Skuodo r.",3.5082162986882E-2,40,{"$f":"IF(F43>0.3, K43/'3. GGbudget'!$I$11/1000*'2. Macro'!$N$38,0)","v":0},17100.7,17313.900000000001,16956.3,16324.4,144.40000000000146,989.50000000000182,0,0,0,0,null,"Vilniaus m. ","Alytaus m. Druskininkų m. Panevėžio raj. ","Vilniaus m. ","Alytaus m. Druskininkų m. Panevėžio raj. ","","","",""]
[null,"Šakių raj.",7.573508930604976E-2,41,"Šakių raj.",5.8385650562010297E-2,41,{"$f":"IF(F44>0.3, K44/'3. GGbudget'!$I$11/1000*'2. Macro'!$N$38,0)","v":0},28219.599999999999,28713,28219.599999999999,27599.599999999999,0,1113.4000000000015,0,0,0,0,null,"Vilniaus m. ","Alytaus m. Druskininkų m. Panevėžio raj. ","Vilniaus m. ","Alytaus m. Druskininkų m. Panevėžio raj. ","","","",""]
[null,"Šalčininkų raj.",8.1241124445466759E-2,42,"Šalčininkų raj.",6.2630359937515992E-2,42,{"$f":"IF(F45>0.3, K45/'3. GGbudget'!$I$11/1000*'2. Macro'!$N$38,0)","v":0},30466.5,31091.200000000001,30271.200000000001,30038.400000000001,195.29999999999927,1052.7999999999993,0,0,0,0,null,"Vilniaus m. ","Alytaus m. Druskininkų m. Panevėžio raj. ","Vilniaus m. ","Alytaus m. Druskininkų m. Panevėžio raj. ","","","",""]
[null,"Šiaulių raj.",9.6151916330379436E-2,43,"Šiaulių raj.",7.4125378859027022E-2,43,{"$f":"IF(F46>0.3, K46/'3. GGbudget'!$I$11/1000*'2. Macro'!$N$38,0)","v":0},35827.1,36107.300000000003,35827.1,34211,0,1896.3000000000029,0,0,0,0,null,"Vilniaus m. ","Alytaus m. Druskininkų m. Panevėžio raj. ","Vilniaus m. ","Alytaus m. Druskininkų m. Panevėžio raj. ","","","",""]
[null,"Šilalės raj.",6.5041583255646671E-2,44,"Šilalės raj.",5.014181915886036E-2,44,{"$f":"IF(F47>0.3, K47/'3. GGbudget'!$I$11/1000*'2. Macro'!$N$38,0)","v":0},24065.1,24831.7,24235.1,23360,-170,1471.7000000000007,1,1,0,0,null,"Vilniaus m. ","Alytaus m. Druskininkų m. Panevėžio raj. Šilalės raj. ","Vilniaus m. ","Alytaus m. Druskininkų m. Panevėžio raj. Šilalės raj. ","","","",""]
[null,"Šilutės raj.",0.11105438850924212,45,"Šilutės raj.",8.5613983957636891E-2,45,{"$f":"IF(F48>0.3, K48/'3. GGbudget'!$I$11/1000*'2. Macro'!$N$38,0)","v":0},41521.199999999997,42528.1,41379.9,41156.300000000003,141.29999999999563,1371.7999999999956,0,0,0,0,null,"Vilniaus m. ","Alytaus m. Druskininkų m. Panevėžio raj. Šilalės raj. ","Vilniaus m. ","Alytaus m. Druskininkų m. Panevėžio raj. Šilalės raj. ","","","",""]
[null,"Širvintų raj.",5.198125502282408E-2,46,"Širvintų raj.",4.0073358589080246E-2,46,{"$f":"IF(F49>0.3, K49/'3. GGbudget'!$I$11/1000*'2. Macro'!$N$38,0)","v":0},19368.7,18757.099999999999,19368.7,17905.2,0,851.89999999999782,0,0,0,0,null,"Vilniaus m. ","Alytaus m. Druskininkų m. Panevėžio raj. Šilalės raj. ","Vilniaus m. ","Alytaus m. Druskininkų m. Panevėžio raj. Šilalės raj. ","","","",""]
[null,"Švenčionių raj.",7.1592949203604761E-2,47,"Švenčionių raj.",5.5192394347272786E-2,47,{"$f":"IF(F50>0.3, K50/'3. GGbudget'!$I$11/1000*'2. Macro'!$N$38,0)","v":0},25839.599999999999,25936.1,26676.2,24892,-836.60000000000218,1044.0999999999985,{"$f":"IF(H50>0,IF(M50/$H$67/10-H50*$H$69<-eps,1,0),IF(($H$69+eps>=0)*(M50<0),1,IF(($H$69+eps<0)*(K50/I50>1.015),1,0)))","v":1},1,0,0,null,"Vilniaus m. ","Alytaus m. Druskininkų m. Panevėžio raj. Šilalės raj. Švenčionių raj. ","Vilniaus m. ","Alytaus m. Druskininkų m. Panevėžio raj. Šilalės raj. Švenčionių raj. ","","","",""]
[null,"Tauragės raj.",0.10507225148167317,48,"Tauragės raj.",8.1002238394173171E-2,48,{"$f":"IF(F51>0.3, K51/'3. GGbudget'!$I$11/1000*'2. Macro'!$N$38,0)","v":0},39150.9,40272.400000000001,39150.9,37046.199999999997,0,3226.2000000000044,0,0,0,0,null,"Vilniaus m. ","Alytaus m. Druskininkų m. Panevėžio raj. Šilalės raj. Švenčionių raj. ","Vilniaus m. ","Alytaus m. Druskininkų m. Panevėžio raj. Šilalės raj. Švenčionių raj. ","","","",""]
[null,"Telšių raj.",0.11658672465488171,49,"Telšių raj.",8.9878969289410832E-2,49,{"$f":"IF(F52>0.3, K52/'3. GGbudget'!$I$11/1000*'2. Macro'!$N$38,0)","v":0},43441.3,42862.3,43441.3,42352.1,0,510.20000000000437,0,0,0,0,null,"Vilniaus m. ","Alytaus m. Druskininkų m. Panevėžio raj. Šilalės raj. Švenčionių raj. ","Vilniaus m. ","Alytaus m. Druskininkų m. Panevėžio raj. Šilalės raj. Švenčionių raj. ","","","",""]
[null,"Trakų raj.",9.0130596171091107E-2,50,"Trakų raj.",6.9483426258673861E-2,50,{"$f":"IF(F53>0.3, K53/'3. GGbudget'!$I$11/1000*'2. Macro'!$N$38,0)","v":0},33583.5,34099.300000000003,33583.5,31341,0,2758.3000000000029,0,0,0,0,null,"Vilniaus m. ","Alytaus m. Druskininkų m. Panevėžio raj. Šilalės raj. Švenčionių raj. ","Vilniaus m. ","Alytaus m. Druskininkų m. Panevėžio raj. Šilalės raj. Švenčionių raj. ","","","",""]
[null,"Ukmergės raj.",9.9552797461530368E-2,51,"Ukmergės raj.",7.6747184143020411E-2,51,{"$f":"IF(F54>0.3, K54/'3. GGbudget'!$I$11/1000*'2. Macro'!$N$38,0)","v":0},37094.300000000003,39279.599999999999,37094.300000000003,35537.199999999997,0,3742.4000000000015,0,0,0,0,null,"Vilniaus m. ","Alytaus m. Druskininkų m. Panevėžio raj. Šilalės raj. Švenčionių raj. ","Vilniaus m. ","Alytaus m. Druskininkų m. Panevėžio raj. Šilalės raj. Švenčionių raj. ","","","",""]
[null,"Utenos raj.",8.839607164847206E-2,52,"Utenos raj.",6.8146247632533602E-2,52,{"$f":"IF(F55>0.3, K55/'3. GGbudget'!$I$11/1000*'2. Macro'!$N$38,0)","v":0},32937.199999999997,33371,32937.199999999997,32665,0,706,0,0,0,0,null,"Vilniaus m. ","Alytaus m. Druskininkų m. Panevėžio raj. Šilalės raj. Švenčionių raj. ","Vilniaus m. ","Alytaus m. Druskininkų m. Panevėžio raj. Šilalės raj. Švenčionių raj. ","","","",""]
[null,"Varėnos raj.",6.7529712119827556E-2,53,"Varėnos raj.",5.2059966001340038E-2,53,{"$f":"IF(F56>0.3, K56/'3. GGbudget'!$I$11/1000*'2. Macro'!$N$38,0)","v":0},24655.200000000001,25454.2,25162.2,24619,-507,835.20000000000073,1,1,0,0,null,"Vilniaus m. ","Alytaus m. Druskininkų m. Panevėžio raj. Šilalės raj. Švenčionių raj. Varėnos raj. ","Vilniaus m. ","Alytaus m. Druskininkų m. Panevėžio raj. Šilalės raj. Švenčionių raj. Varėnos raj. ","","","",""]
[null,"Vilkaviškio raj.",8.8018195967233093E-2,54,"Vilkaviškio raj.",6.7854935934312133E-2,54,{"$f":"IF(F57>0.3, K57/'3. GGbudget'!$I$11/1000*'2. Macro'!$N$38,0)","v":0},32796.400000000001,33069.5,32796.400000000001,32424.6,0,644.90000000000146,0,0,0,0,null,"Vilniaus m. ","Alytaus m. Druskininkų m. Panevėžio raj. Šilalės raj. Švenčionių raj. Varėnos raj. ","Vilniaus m. ","Alytaus m. Druskininkų m. Panevėžio raj. Šilalės raj. Švenčionių raj. Varėnos raj. ","","","",""]
[null,"Vilniaus  raj.",0.22191312973750182,55,"Vilniaus  raj.",0.17107713962833948,55,{"$f":"IF(F58>0.3, K58/'3. GGbudget'!$I$11/1000*'2. Macro'!$N$38,0)","v":0},82686.899999999994,86456.7,82686.899999999994,76886.100000000006,0,9570.5999999999913,0,0,0,0,null,"Vilniaus m. ","Alytaus m. Druskininkų m. Panevėžio raj. Šilalės raj. Švenčionių raj. Varėnos raj. ","Vilniaus m. ","Alytaus m. Druskininkų m. Panevėžio raj. Šilalės raj. Švenčionių raj. Varėnos raj. ","","","",""]
[null,"Zarasų raj.",4.9027222619842846E-2,56,"Zarasų raj.",3.7796037664134294E-2,56,{"$f":"IF(F59>0.3, K59/'3. GGbudget'!$I$11/1000*'2. Macro'!$N$38,0)","v":0},18268,18348.2,18268,17472,0,876.20000000000073,0,0,0,0,null,"Vilniaus m. ","Alytaus m. Druskininkų m. Panevėžio raj. Šilalės raj. Švenčionių raj. Varėnos raj. ","Vilniaus m. ","Alytaus m. Druskininkų m. Panevėžio raj. Šilalės raj. Švenčionių raj. Varėnos raj. ","","","",""]
[null,"Elektrėnų sav.",7.2030673092880887E-2,57,"Elektrėnų sav.",5.5529844190880209E-2,57,{"$f":"IF(F60>0.3, K60/'3. GGbudget'!$I$11/1000*'2. Macro'!$N$38,0)","v":0},26839.3,25920.9,26839.3,25553.1,0,367.80000000000291,0,0,0,0,null,"Vilniaus m. ","Alytaus m. Druskininkų m. Panevėžio raj. Šilalės raj. Švenčionių raj. Varėnos raj. ","Vilniaus m. ","Alytaus m. Druskininkų m. Panevėžio raj. Šilalės raj. Švenčionių raj. Varėnos raj. ","","","",""]
[null,"Kalvarijos sav.",2.6995030733739395E-2,58,"Kalvarijos sav.",2.0810993236723301E-2,58,{"$f":"IF(F61>0.3, K61/'3. GGbudget'!$I$11/1000*'2. Macro'!$N$38,0)","v":0},9680.2000000000007,10249.4,10058.6,9893,-378.39999999999964,356.39999999999964,1,1,0,0,null,"Vilniaus m. ","Alytaus m. Druskininkų m. Panevėžio raj. Šilalės raj. Švenčionių raj. Varėnos raj. Kalvarijos sav. ","Vilniaus m. ","Alytaus m. Druskininkų m. Panevėžio raj. Šilalės raj. Švenčionių raj. Varėnos raj. Kalvarijos sav. ","","","",""]
[null,"Kazlų Rūdos sav.",2.9090523147882887E-2,59,"Kazlų Rūdos sav.",2.2426449017769721E-2,59,{"$f":"IF(F62>0.3, K62/'3. GGbudget'!$I$11/1000*'2. Macro'!$N$38,0)","v":0},10839.4,10951.5,10839.4,10455.799999999999,0,495.70000000000073,0,0,0,0,null,"Vilniaus m. ","Alytaus m. Druskininkų m. Panevėžio raj. Šilalės raj. Švenčionių raj. Varėnos raj. Kalvarijos sav. ","Vilniaus m. ","Alytaus m. Druskininkų m. Panevėžio raj. Šilalės raj. Švenčionių raj. Varėnos raj. Kalvarijos sav. ","","","",""]
[null,"Pagėgių sav.",2.8811142051171384E-2,60,"Pagėgių sav.",2.2211068706797725E-2,60,{"$f":"IF(F63>0.3, K63/'3. GGbudget'!$I$11/1000*'2. Macro'!$N$38,0)","v":0},10735.3,10783.7,10735.3,10294.799999999999,0,488.90000000000146,0,0,0,0,null,"Vilniaus m. ","Alytaus m. Druskininkų m. Panevėžio raj. Šilalės raj. Švenčionių raj. Varėnos raj. Kalvarijos sav. ","Vilniaus m. ","Alytaus m. Druskininkų m. Panevėžio raj. Šilalės raj. Švenčionių raj. Varėnos raj. Kalvarijos sav. ","","","",""]
[null,"Rietavo sav.",2.4319574294626119E-2,61,"Rietavo sav.",1.8748431930210519E-2,61,{"$f":"IF(F64>0.3, K64/'3. GGbudget'!$I$11/1000*'2. Macro'!$N$38,0)","v":0},9061.7000000000007,8751.2000000000007,9061.7000000000007,8497.5,0,253.70000000000073,0,0,0,0,null,"Vilniaus m. ","Alytaus m. Druskininkų m. Panevėžio raj. Šilalės raj. Švenčionių raj. Varėnos raj. Kalvarijos sav. ","Vilniaus m. ","Alytaus m. Druskininkų m. Panevėžio raj. Šilalės raj. Švenčionių raj. Varėnos raj. Kalvarijos sav. ","","","",""]
[null,null,null,null,null,null,null,null,null,null,null,null,null,"T3",{"$f":"SUMIF($H$5:$H$64,\">0\",O5:O64)","v":1},{"$f":"SUMIF($H$5:$H$64,\">0\",P5:P64)","v":1},{"$f":"SUMIF($H$5:$H$64,\">0\",Q5:Q64)","v":0},{"$f":"SUMIF($H$5:$H$64,\">0\",R5:R64)","v":0}]
[null,null,null,"t =",null,null,"t =",{"$f":" FirstYear + 7","v":2019},null,null,null,null,null,"T5",{"$f":"SUMIF($H$5:$H$64,\"=0\",O5:O64)","v":7},{"$f":"SUMIF($H$5:$H$64,\"=0\",P5:P64)","v":7},{"$f":"SUMIF($H$5:$H$64,\"=0\",Q5:Q64)","v":0},{"$f":"SUMIF($H$5:$H$64,\"=0\",R5:R64)","v":0}]
[null,null,null,"YNP(t–1) =",null,null,"Y*(t–1) =",{"$f":"+'2. Macro'!N16","v":37260.931833014685},{"$f":"+'2. Macro'!N15","v":37379.937220754902},null,null,null,null,null,{"$f":"T64","v":"Vilniaus m. "},{"$f":"V64","v":"Vilniaus m. "},{"$f":"X64","v":""},{"$f":"Z64","v":""}]
[null,null,null,"YN(t–1) =",null,null,"YN(t–1) =",{"$f":"'3. GGbudget'!H6","v":48333.108783344796},{"$f":"'3. GGbudget'!L6","v":48494.418850914291},null,null,null,null,null,{"$f":"U64","v":"Alytaus m. Druskininkų m. Panevėžio raj. Šilalės raj. Švenčionių raj. Varėnos raj. Kalvarijos sav. "},{"$f":"W64","v":"Alytaus m. Druskininkų m. Panevėžio raj. Šilalės raj. Švenčionių raj. Varėnos raj. Kalvarijos sav. "},{"$f":"Y64","v":""},{"$f":"AA64","v":""}]
[null,null,null,"AP(t) =",null,null,"AP(t) =",{"$f":"'2. Macro'!O20","v":2.2001854638479479},{"$f":"'2. Macro'!O19","v":2.7273081562109613}]
[null,null,null,"Sources:",null,null,"Šaltiniai:"]
[null,null,null,"Ministry of Finance",null,null,"Finansų ministerija","FM"]
[null,null,null,"Independent Fiscal Institution",null,null,"Fiskalinė institucija","IFI"]

{"sheet":"5. SurplusGG","index":6,"n_rows":31,"n_cols":11,"rows_kept":31,"cut":false,"hidden":false,"merged":[[0,6,0,7],[15,2,15,5],[15,7,15,10],[17,9,17,10],[4,7,4,8],[4,2,4,3],[5,8,6,8],[3,6,4,6],[0,1,0,2],[5,2,6,2],[5,1,6,1],[7,1,8,1],[9,1,10,1],[11,1,12,1],[2,1,2,5],[3,1,4,1],[20,9,20,10],[22,9,22,10],[25,9,25,10],[24,9,24,10],[7,3,8,3],[7,8,8,8],[13,3,14,3],[13,8,14,8],[11,3,12,3],[11,8,12,8],[9,6,10,6],[11,6,12,6],[9,8,10,8],[13,6,14,6],[7,6,8,6],[25,4,25,5],[24,4,24,5],[3,4,3,5],[20,4,20,5],[17,4,17,5],[5,6,6,6],[22,4,22,5],[13,1,14,1],[13,2,14,2],[2,6,2,10],[7,2,8,2],[9,2,10,2],[11,2,12,2],[9,3,10,3],[3,9,3,10],[5,3,6,3],[5,7,6,7],[13,7,14,7],[11,7,12,7],[9,7,10,7],[7,7,8,7]]}
[null,"↖ atgal į turinį ",null,null,null,null,"↖ back to content"]
[{"$f":"Kalba","v":"LT"}]
[null,"5 lentelė. Perteklinio VS taisyklės sąlygos",null,null,null,null,"Table 4. Conditions of the surplus GG sector rule"]
[null,"Nr.","Sąlyga","Formulė","Išvada",null,"No.","Condition","Formula","Conclusion"]
[null,null,"Institucija, kurios projekcijų pagrindu atliekama analizė",null,"FM","IFI",null,"Institution, projections of which are used for the analysis",null,"MoF","IFI"]
[null,"S1","VS yra faktiškai perteklinis t metais pagal struktūrinį balansą","SB(t) > 0*",{"$f":"IF(J6,\"Tiesa\",\"Netiesa\")","v":"Netiesa"},{"$f":"IF(K6,\"Tiesa\",\"Netiesa\")","v":"Netiesa"},"C1","In terms of structural balance GG sector is actually in surplus   ","SB(t) > 0*",{"$f":"IF(J19>eps,TRUE,FALSE)","v":false},{"$f":"IF(K19>eps,TRUE,FALSE)","v":false}]
[null,null,null,null,{"$f":"CONCATENATE(TEXT(ROUND(J19,1),\"0,0; –0,0\"),IF(J6,\" ≥ \",\" < \"),\"0,1\")","v":" –0,7 < 0,1"},{"$f":"CONCATENATE(TEXT(K19,\"0,0; –0,0\"),IF(K6,\" ≥ \",\" < \"),\"0,1\")","v":" –1,3 < 0,1"},null,null,null,{"$f":"CONCATENATE(TEXT(ROUND(J19,1),\"0.0; –0.0\"),IF(J6,\" ≥ \",\" < \"),\"0.1\")","v":" –01 < 0.1"},{"$f":"CONCATENATE(TEXT(ROUND(K19,1),\"0.0; –0.0\"),IF(K6,\" ≥ \",\" < \"),\"0.1\")","v":" –01 < 0.1"}]
[null,"S2","Faktinio struktūrinio VS balanso rodiklio absoliučioji vertė yra mažesnė negu VLT absoliučioji vertė ir kiekvienais metais mažėja, išskyrus metus, kai produkcijos atotrūkio nuo potencialo rodiklis yra neigiamas","|SB(t)| < |VLT| ir \n|SB(t)| < |SB(t–1)| ir\nAP(t) ≥ 0",{"$f":"IF(J8,\"Tiesa\",\"Netiesa\")","v":"Tiesa"},{"$f":"IF(K8,\"Tiesa\",\"Netiesa\")","v":"Netiesa"},"C2","Actual structural GG sector balance indicator in absolute value is lower than MTO in absolute value and is annually decreasing, with the exception of the  year when the output gap is negative","|SB(t)| < |MTO| and\n|SB(t)| < |SB(t–1)| and\nOG(t) ≥ 0",{"$f":"IF((J22>=-eps)*(ABS(J19)+eps<ABS($J$21))*(ABS(J19)+0.1<ABS(J20)),TRUE,FALSE)","v":true},{"$f":"IF((K22>=-eps)*(ABS(K19)+eps<ABS($J$21))*(ABS(K19)+0.1<ABS(K20)),TRUE,FALSE)","v":false}]
[null,null,null,null,{"$f":"CONCATENATE(TEXT(ROUND(ABS(E19),1),\"0,0; –0,0\"),IF(ABS(E19)+eps<ABS($E$21),\" < \",\" ≥ \"),TEXT(ROUND(ABS(E21),1),\"0,0; –0,0\"),\" ir \n\",TEXT(ROUND(ABS(E19),1),\"0,0; –0,0\"),IF(ABS(E19)+0.1<ABS(E20),\" < \",\" ≥ \"),TEXT(ROUND(ABS(E20),1),\"0,0; –0,0\"),\" ir\n \",TEXT(ROUND(E22,1),\"0,0; –0,0\"),IF(E22<-eps,\" < \",\" ≥ \"),\"0,0\")","v":"0,7 < 1,0 ir \n0,7 < 1,4 ir\n 2,2 ≥ 0,0"},{"$f":"CONCATENATE(TEXT(ROUND(ABS(F19),1),\"0,0; –0,0\"),IF(ABS(F19)+eps<ABS($E$21),\" < \",\" ≥ \"),TEXT(ROUND(ABS(E21),1),\"0,0; –0,0\"),\" ir \n\",TEXT(ROUND(ABS(F19),1),\"0,0; –0,0\"),IF(ABS(F19)+0.1<ABS(F20),\" < \",\" ≥ \"),TEXT(ROUND(ABS(F20),1),\"0,0; –0,0\"),\" ir\n \",TEXT(ROUND(F22,1),\"0,0; –0,0\"),IF(F22<-eps,\" < \",\" ≥ \"),\"0,0\")","v":"1,3 ≥ 1,0 ir \n1,3 < 1,4 ir\n 2,7 ≥ 0,0"},null,null,null,{"$f":"CONCATENATE(TEXT(ROUND(ABS(J19),1),\"0.0; –0.0\"),IF(ABS(J19)+eps<ABS($J$21),\" < \",\" ≥ \"),TEXT(ROUND(ABS($J$21),1),\"0.0; –0.0\"),\" and\n\",TEXT(ROUND(ABS(J19),1),\"0.0; –0.0\"),IF(ABS(J19)+0.1<ABS(J20),\" < \",\" ≥ \"),TEXT(ROUND(ABS(J20),1),\"0.0; –0.0\"),\" and\n\",TEXT(ROUND(J22,1),\"0.0; –0.0\"),IF(J22<-eps,\" < \",\" ≥ \"),\"0.0\")","v":"01 < 01 and\n01 < 01 and\n02 ≥ 0.0"},{"$f":"CONCATENATE(TEXT(ROUND(ABS(K19),1),\"0.0; –0.0\"),IF(ABS(K19)+eps<ABS($J$21),\" < \",\" ≥ \"),TEXT(ROUND(ABS($J$21),1),\"0.0; –0.0\"),\" and\n\",TEXT(ROUND(ABS(K19),1),\"0.0; –0.0\"),IF(ABS(K19)+0.1<ABS(K20),\" < \",\" ≥ \"),TEXT(ROUND(ABS(K20),1),\"0.0; –0.0\"),\" and\n\",TEXT(ROUND(K22,1),\"0.0; –0.0\"),IF(K22<-eps,\" < \",\" ≥ \"),\"0.0\")","v":"01 ≥ 01 and\n01 < 01 and\n03 ≥ 0.0"}]
[null,"S3","Faktinio struktūrinio VS balanso rodiklio absoliučioji vertė yra mažesnė negu VLT absoliučioji vertė tais metais, kai produkcijos atotrūkio nuo potencialo rodiklis yra neigiamas","|SB(t)| < |VLT| ir\nAP(t) < 0",{"$f":"IF(J10,\"Tiesa\",\"Netiesa\")","v":"Netiesa"},{"$f":"IF(K10,\"Tiesa\",\"Netiesa\")","v":"Netiesa"},"C3","Actual structural GG sector balance indicator in absolute value is lower than the MTO in absolute value in the year when the output gap is negative","|SB(t)| < |MTO| and\nOG(t) < 0",{"$f":"IF((J22<-eps)*(ABS(J19)+eps<ABS($J$21)),TRUE,FALSE)","v":false},{"$f":"IF((K22<-eps)*(ABS(K19)+eps<ABS($J$21)),TRUE,FALSE)","v":false}]
[null,null,null,null,{"$f":"CONCATENATE(TEXT(ROUND(ABS(E19),1),\"0,0; –0,0\"),IF(ABS(E19)+eps<ABS($E$21),\" < \",\" ≥ \"),TEXT(ROUND(ABS($E$21),1),\"0,0; –0,0\"),\" ir\n\",TEXT(ROUND(E22,1),\"0,0; –0,0\"),IF(E22<-eps,\" < \",\" ≥ \"),\"0,0\")","v":"0,7 < 1,0 ir\n2,2 ≥ 0,0"},{"$f":"CONCATENATE(TEXT(ROUND(ABS(F19),1),\"0,0; –0,0\"),IF(ABS(F19)+eps<ABS($E$21),\" < \",\" ≥ \"),TEXT(ROUND(ABS($E$21),1),\"0,0; –0,0\"),\" ir\n\",TEXT(ROUND(F22,1),\"0,0; –0,0\"),IF(F22<-eps,\" < \",\" ≥ \"),\"0,0\")","v":"1,3 ≥ 1,0 ir\n2,7 ≥ 0,0"},null,null,null,{"$f":"CONCATENATE(TEXT(ROUND(ABS(J19),1),\"0.0; –0.0\"),IF(ABS(J19)+eps<ABS($J$21),\" < \",\" ≥ \"),TEXT(ROUND(ABS($J$21),1),\"0.0; –0.0\"),\" and\n\",TEXT(ROUND(J22,1),\"0.0; –0.0\"),IF(J22<-eps,\" < \",\" ≥ \"),\"0.0\")","v":"01 < 01 and\n02 ≥ 0.0"},{"$f":"CONCATENATE(TEXT(ROUND(ABS(K19),1),\"0.0; –0.0\"),IF(ABS(K19)+eps<ABS($J$21),\" < \",\" ≥ \"),TEXT(ROUND(ABS($J$21),1),\"0.0; –0.0\"),\" and\n\",TEXT(ROUND(K22,1),\"0.0; –0.0\"),IF(K22<-eps,\" < \",\" ≥ \"),\"0.0\")","v":"01 ≥ 01 and\n03 ≥ 0.0"}]
[null,"S4","Faktinio struktūrinio VS balanso rodiklio postūmio VLT link absoliučioji vertė yra ne mažesnė negu struktūrinio postūmio užduoties absoliučioji vertė","SPU(t) > 0 ir\nSB(t) ≥ SB(t–1)+SPU(t)",{"$f":"IF(J12,\"Tiesa\",\"Netiesa\")","v":"Netiesa"},{"$f":"IF(K12,\"Tiesa\",\"Netiesa\")","v":"Netiesa"},"C4","Actual structural GG sector balance indicator adjustment towards the MTO in absolute value is not lower than the structural adjustment target in absolute value.","SAT(t) > 0 and\nSB(t) ≥ SB(t–1)+SAT(t)",{"$f":"IF(($J$23>0)*(J19>=J20+$J$23),TRUE,FALSE)","v":false},{"$f":"IF(($J$23>0)*(K19>=K20+$J$23),TRUE,FALSE)","v":false}]
[null,null,null,null,{"$f":"IF($E$23=0,\"Netaikoma\",CONCATENATE(TEXT(ROUND(E19,1),\"0,0; –0,0\"),IF(E19>=E20+$E$23,\" ≥ \",\" < \"),TEXT(ROUND(E20,1),\"0,0; –0,0\"),\" + \",TEXT(ROUND($E$23,1),\"0,0; –0,0\"),\" = \",TEXT(ROUND(J20+$E$23,1),\"0,0; –0,0\")))","v":"Netaikoma"},{"$f":"IF($E$23=0,\"Netaikoma\",CONCATENATE(TEXT(ROUND(F19,1),\"0,0; –0,0\"),IF(F19>=F20+$E$23,\" ≥ \",\" < \"),TEXT(ROUND(F20,1),\"0,0; –0,0\"),\" + \",TEXT(ROUND($E$23,1),\"0,0; –0,0\"),\" = \",TEXT(ROUND(K20+$E$23,1),\"0,0; –0,0\")))","v":"Netaikoma"},null,null,null,{"$f":"IF($J$23=0,\"Not aplicaple\",CONCATENATE(TEXT(ROUND(J19,1),\"0.0; –0.0\"),IF(J19>=J20+$J$23,\" ≥ \",\" < \"),TEXT(ROUND(J20,1),\"0.0; –0.0\"),\" + \",TEXT(ROUND($J$23,1),\"0.0; –0.0\"),\" = \",TEXT(ROUND(J20+$J$23,1),\"0.0; –0.0\")))","v":"Not aplicaple"},{"$f":"IF($J$23=0,\"Not aplicaple\",CONCATENATE(TEXT(ROUND(K19,1),\"0.0; –0.0\"),IF(K19>=K20+$J$23,\" ≥ \",\" < \"),TEXT(ROUND(K20,1),\"0.0; –0.0\"),\" + \",TEXT(ROUND($J$23,1),\"0.0; –0.0\"),\" = \",TEXT(ROUND(K20+$J$23,1),\"0.0; –0.0\")))","v":"Not aplicaple"}]
[null,"S","t metais, išskyrus metus, kuriais susidaro išskirtinės aplinkybės, turi būti tenkinama bent viena iš  S1–S4 sąlygų ",null,{"$f":"IF(OR(J6,J8,J10,J12),\"Taip\",\"Ne\")","v":"Taip"},{"$f":"IF(OR(K6,K8,K10,K12),\"Taip\",\"Ne\")","v":"Ne"},"C","At year t, with the exception of the year of exceptional circumstances, at least one of the C1–C4 conditions is satisfied ",null,{"$f":"IF(E31>0,\"Yes\",\"No\")","v":"Yes"},{"$f":"IF(F31>0,\"Yes\",\"No\")","v":"No"}]
[null,null,null,null,{"$f":"IF(J14=\"Yes\",IF(E31=1,CONCATENATE(\"Tenkinama \",I27,I28,I29,I30,\" sąlyga\"),CONCATENATE(\"Tenkinamos \", IF(E27=1,CONCATENATE(I27,\" \"),\"\"),IF(E28=1,CONCATENATE(I28,\" \"),\"\"),IF(E29=1,CONCATENATE(I29,\" \"),\"\"),IF(E30=1,CONCATENATE(I30,\" \"),\"\"),\"sąlygos\")),\"Netenkinama nei viena iš sąlygų\")","v":"Tenkinama S2 sąlyga"},{"$f":"IF(K14=\"Yes\",IF(F31=1,CONCATENATE(\"Tenkinama \",H27,H28,H29,H30,\" sąlyga\"),CONCATENATE(\"Tenkinamos \", IF(F27=1,CONCATENATE(H27,\" \"),\"\"),IF(F28=1,CONCATENATE(H28,\" \"),\"\"),IF(F29=1,CONCATENATE(H29,\" \"),\"\"),IF(F30=1,CONCATENATE(H30,\" \"),\"\"),\"sąlygos\")),\"Netenkinama nei viena iš sąlygų\")","v":"Netenkinama nei viena iš sąlygų"},null,null,null,{"$f":"IF(J14=\"Yes\",IF(E31=1,CONCATENATE(\"Condition \",J27,J28,J29,J30,\" is valid\"),CONCATENATE(\"Conditions \", IF(E27=1,CONCATENATE(J27,\" \"),\"\"),IF(E28=1,CONCATENATE(J28,\" \"),\"\"),IF(E29=1,CONCATENATE(J29,\" \"),\"\"),IF(E30=1,CONCATENATE(J30,\" \"),\"\"),\"are valid\")),\"None of the conditions is valid\")","v":"Condition C2 is valid"},{"$f":"IF(K14=\"Yes\",IF(F31=1,CONCATENATE(\"Condition \",K27,K28,K29,K30,\" is valid\"),CONCATENATE(\"Conditions \", IF(F27=1,CONCATENATE(K27,\" \"),\"\"),IF(F28=1,CONCATENATE(K28,\" \"),\"\"),IF(F29=1,CONCATENATE(K29,\" \"),\"\"),IF(F30=1,CONCATENATE(K30,\" \"),\"\"),\"are valid\")),\"None of the conditions is valid\")","v":"None of the conditions is valid"}]
[null,null,"* nelygybės ženklas yra griežtas, jei skirtumas tarp lyginamų pusių po apvalinimo sudaro bent 0,1, \nkitaip ženklas interpretuojamas kaip =",null,null,null,null,"* inequality sign is strict, if a difference between both compared sides\n after rounding is at least 0,1, else the sign is interpreted as ="]
[null,null,"Šaltinis: KĮ 3 straipsnis 1 dalis",null,null,null,null,"Source: CL Article 3(1)"]
[null,null,null,"t =",{"$f":"FirstYear+8","v":2020},null,null,null,"t =",{"$f":"E18","v":2020}]
[null,null,null,"SB(t) =",{"$f":"'3. GGbudget'!G19","v":-0.67575981292697307},{"$f":"'3. GGbudget'!K19","v":-1.3042547704636034},null,null,"SB(t) =",{"$f":"E19","v":-0.67575981292697307},{"$f":"F19","v":-1.3042547704636034}]
[null,null,null,"SB(t–1) =",{"$f":"'3. GGbudget'!F19","v":-1.4232501955509695},{"$f":"'3. GGbudget'!J19","v":-1.427278906839808},null,null,"SB(t–1) =",-1.4232501955509695,{"$f":"F20","v":-1.427278906839808}]
[null,null,null,"VLT =",{"$f":"'3. GGbudget'!F22","v":-1},null,null,null,"MTO =",-1]
[null,null,null,"AP(t) =",{"$f":"'2. Macro'!O20","v":2.2001854638479479},{"$f":"'2. Macro'!O19","v":2.7273081562109613},null,null,"OG(t) =",2.2001854638479479,{"$f":"F22","v":2.7273081562109613}]
[null,null,null,"SPU(t) =",{"$f":"'3. GGbudget'!F23","v":0},null,null,null,"SAT(t) =",0]
[null,null,null,"Šaltiniai:",null,null,null,null,"Sources:"]
[null,null,null,"Finansų ministerija","FM",null,null,null,"Ministry of Finance","MoF"]
[null,null,null,"Fiskalinė institucija","IFI",null,null,null,"Independent Fiscal Institution","IFI"]
[null,null,"S1","C1",{"$f":"J6*1","v":0},{"$f":"(K6)*1","v":0},{"$f":"IF(#REF!=1,$C27,\"\")","v":{"$error":"#REF!"}},{"$f":"IF(F27=1,$C27,\"\")","v":""},{"$f":"IF(E27=1,$C27,\"\")","v":""},{"$f":"IF(E27=1,$D27,\"\")","v":""},""]
[null,null,"S2","C2",{"$f":"J8*1","v":1},{"$f":"(K8)*1","v":0},{"$f":"IF(#REF!=1,$C28,\"\")","v":{"$error":"#REF!"}},{"$f":"IF(F28=1,$C28,\"\")","v":""},{"$f":"IF(E28=1,$C28,\"\")","v":"S2"},"C2",""]
[null,null,"S3","C3",{"$f":"J10*1","v":0},{"$f":"(K10)*1","v":0},{"$f":"IF(#REF!=1,$C29,\"\")","v":{"$error":"#REF!"}},{"$f":"IF(F29=1,$C29,\"\")","v":""},{"$f":"IF(E29=1,$C29,\"\")","v":""},"",""]
[null,null,"S4","C4",{"$f":"J12*1","v":0},{"$f":"(K12)*1","v":0},{"$f":"IF(#REF!=1,$C30,\"\")","v":{"$error":"#REF!"}},{"$f":"IF(F30=1,$C30,\"\")","v":""},{"$f":"IF(E30=1,$C30,\"\")","v":""},"",""]
[null,null,null,null,{"$f":"SUM(E27:E30)","v":1},{"$f":"SUM(F27:F30)","v":0}]

{"sheet":"6. GGexpenditure","index":7,"n_rows":60,"n_cols":13,"rows_kept":60,"cut":false,"hidden":false,"merged":[[53,5,53,6],[53,11,53,12],[40,5,40,6],[39,5,39,6],[39,11,39,12],[40,11,40,12],[41,11,41,12],[52,5,52,6],[52,11,52,12],[45,5,45,6],[45,11,45,12],[51,5,51,6],[51,11,51,12],[42,5,42,6],[42,11,42,12],[41,5,41,6],[28,2,28,4],[23,3,23,4],[20,3,20,4],[20,5,20,6],[0,7,0,8],[4,8,4,10],[9,9,10,10],[5,2,6,2],[11,2,12,2],[11,7,12,7],[7,8,8,8],[7,2,8,2],[23,9,23,10],[21,8,25,8],[24,3,25,4],[24,9,25,10],[30,5,30,6],[30,11,30,12],[34,5,34,6],[33,11,33,12],[34,11,34,12],[33,5,33,6],[3,1,4,1],[18,2,19,2],[18,8,19,8],[18,1,19,1],[3,3,3,4],[3,5,3,6],[14,7,15,7],[16,7,17,7],[14,8,15,8],[16,8,17,8],[16,3,17,4],[16,2,17,2],[5,1,6,1],[5,3,6,4],[7,1,8,1],[5,8,6,8],[3,7,4,7],[11,3,12,4],[7,3,8,4],[7,9,8,10],[5,7,6,7],[7,7,8,7],[11,8,12,8],[11,9,12,10],[5,9,6,10],[4,2,4,4],[13,9,13,10],[18,7,19,7],[21,7,25,7],[18,3,19,4],[18,9,19,10],[21,3,22,4],[21,9,22,10],[11,1,12,1],[14,1,15,1],[16,1,17,1],[14,2,15,2],[14,3,15,4],[13,3,13,4],[21,1,25,1],[21,2,25,2],[26,1,27,1],[26,2,27,2],[26,8,27,8],[26,3,27,4],[26,9,27,10],[26,7,27,7],[20,11,20,12],[20,9,20,10],[0,1,0,2],[9,3,10,4],[9,2,10,2],[9,1,10,1],[9,8,10,8],[2,7,2,12],[2,1,2,6],[16,9,17,10],[14,9,15,10],[9,7,10,7],[3,11,3,12],[3,9,3,10]]}
[null,"↖ atgal į turinį ",null,null,null,null,null,"↖ back to content"]
[{"$f":"Kalba","v":"LT"}]
[null,"6 lentelė. VS išlaidų augimo ribojimo taisyklė",null,null,null,null,null,"Table 5. GG expenditure growth limiting rule"]
[null,"Nr.","VS išlaidų augimo ribojimo taisyklės netaikymo aplinkybės","Formulė",null,"Išvada",null,"No.","GG expenditure growh limiting rule application escape clause","Formula",null,"Conclusion"]
[null,null,"Institucija, kurios projekcijų pagrindu atliekama analizė",null,null,"FM","IFI",null,"Institution, projections of which are used for the analysis",null,null,"MoF","IFI"]
[null,"A1","Pagal 4 paskutinius metų ketvirčius apskaičiuotas Lietuvos BVP to meto kainomis augimas yra mažesnis negu daugiametis ES BVP to meto kainomis augimas, padidintas 2 procentiniais punktais",null,null,{"$f":"IF(L6,\"Tiesa\",\"Netiesa\")","v":"Netiesa"},{"$f":"IF(M6,\"Tiesa\",\"Netiesa\")","v":"Netiesa"},"E1","Lithuanian GDP at current prices calculated on the basis of 4 last quarters of the year grows at a slower pace than the multi-annual growth of the GDP of the EU at current prices increased by 2 percentage points",null,null,{"$f":"IF('6. GGexpenditure'!L44+eps<AVERAGE('2. Macro'!H33:L33)+2,TRUE,FALSE)","v":false},{"$f":"IF('6. GGexpenditure'!M44+eps<AVERAGE('2. Macro'!I33:M33)+2,TRUE,FALSE)","v":false}]
[null,null,null,null,null,{"$f":"CONCATENATE(TEXT(ROUND('6. GGexpenditure'!L44,1),\"0,0;–0,0\"),IF(L6,\" < \",\" ≥ \"),TEXT(ROUND(AVERAGE('2. Macro'!I33:M33)+2,1),\"0,0;–0,0\"))","v":"7,4 ≥ 5,2"},{"$f":"CONCATENATE(TEXT(ROUND('6. GGexpenditure'!M44,1),\"0,0;–0,0\"),IF(M6,\" < \",\" ≥ \"),TEXT(ROUND(AVERAGE('2. Macro'!I33:M33)+2,1),\"0,0;–0,0\"))","v":"7,3 ≥ 5,2"},null,null,null,null,{"$f":"CONCATENATE(TEXT(ROUND('6. GGexpenditure'!L44,1),\"0.0;–0.0\"),IF(L6,\" < \",\" ≥ \"),TEXT(ROUND(AVERAGE('2. Macro'!I33:M33)+2,1),\"0.0;–0.0\"))","v":"07 ≥ 05"},{"$f":"CONCATENATE(TEXT(ROUND('6. GGexpenditure'!M44,1),\"0.0;–0.0\"),IF(M6,\" < \",\" ≥ \"),TEXT(ROUND(AVERAGE('2. Macro'!J33:N33)+2,1),\"0.0;–0.0\"))","v":"07 ≥ 05"}]
[null,"A2","Numatomas VS balanso rodiklio postūmis yra teigiamas ir sudaro bent 1,0 procentinį punktą BVP","B(t) ≥ B(t–1)+1",null,{"$f":"IF(L8,\"Tiesa\",\"Netiesa\")","v":"Netiesa"},{"$f":"IF(M8,\"Tiesa\",\"Netiesa\")","v":"Netiesa"},"E2","Projected GG sector balance indicator adjustment is positive and makes up at least 1.0 percentage point of GDP","B(t) ≥ B(t–1)+1",null,{"$f":"IF('3. GGbudget'!G7>='3. GGbudget'!F7+1,TRUE,FALSE)","v":false},{"$f":"IF('3. GGbudget'!K7>='3. GGbudget'!J7+1,TRUE,FALSE)","v":false}]
[null,null,null,null,null,{"$f":"CONCATENATE(TEXT(ROUND('3. GGbudget'!G7,1),\"0,0;–0,0\"),IF(L8,\" ≥ \",\" < \"),TEXT(ROUND('3. GGbudget'!F7+1,1),\"0,0;–0,0\"))","v":"0,2 < 1,1"},{"$f":"CONCATENATE(TEXT(ROUND('3. GGbudget'!K7,1),\"0,0;–0,0\"),IF(M8,\" ≥ \",\" < \"),TEXT(ROUND('3. GGbudget'!J7+1,1),\"0,0;–0,0\"))","v":"–0,2 < 1,0"},null,null,null,null,{"$f":"CONCATENATE(TEXT(ROUND('3. GGbudget'!G7,1),\"0.0;–0.0\"),IF(L8,\" ≥ \",\" < \"),TEXT(ROUND('3. GGbudget'!F7+1,1),\"0.0;–0.0\"))","v":"00 < 01"},{"$f":"CONCATENATE(TEXT(ROUND('3. GGbudget'!K7,1),\"0.0;–0.0\"),IF(M8,\" ≥ \",\" < \"),TEXT(ROUND('3. GGbudget'!J7+1,1),\"0.0;–0.0\"))","v":"–00 < 01"}]
[null,"A2*","A2, kai numatomas einamųjų metų VS balanso rodiklio teigiamas postūmis nėra mažesnis už suplanuotą einamųjų kalendorinių metų VS balanso rodiklio teigiamą postūmį daugiau kaip 0,5 procentinio punkto BVP to meto kainomis","B(t) ≥ B(t–1)+1  ir\nB(t–1)–B(t–2) ≥ \nBP(t–1)–BP(t–2)+0,5",null,{"$f":"IF(L10,\"Tiesa\",\"Netiesa\")","v":"Netiesa"},{"$f":"IF(M10,\"Tiesa\",\"Netiesa\")","v":"Netiesa"},"E2*","E2, when projected current year GG sector balance indicator positive adjustment is not greater than planned current year GG positive adjustment more than by 0,5 % of GDP at current prices","B(t) ≥ B(t–1)+1  and\nB(t–1)–B(t–2) ≥  \nBP(t–1)–BP(t–2)+0,5",null,{"$f":"IF(('3. GGbudget'!G7>='3. GGbudget'!F7+1)*(L38-L39>=0.5),TRUE,FALSE)","v":false},{"$f":"IF(('3. GGbudget'!K7>='3. GGbudget'!J7+1)*(M38-M39>=0.5),TRUE,FALSE)","v":false}]
[null,null,null,null,null,{"$f":"CONCATENATE(TEXT(ROUND('3. GGbudget'!G7,1),\"0,0;–0,0\"),IF(('3. GGbudget'!G7>='3. GGbudget'!F7+1),\" ≥ \",\" < \"),TEXT(ROUND('3. GGbudget'!F7+1,1),\"0,0;–0,0\"),\" ir\n\",TEXT(ROUND(F38,1),\"0,0;–0,0\"),IF(F38-F39>=0.5,\" ≥ \",\" < \"),TEXT(ROUND(F39+0.5,1),\"0,0;–0,0\"))","v":"0,2 < 1,1 ir\n–0,5 < –0,2"},{"$f":"CONCATENATE(TEXT(ROUND('3. GGbudget'!K7,1),\"0,0;–0,0\"),IF(('3. GGbudget'!K7>='3. GGbudget'!J7+1),\" ≥ \",\" < \"),TEXT(ROUND('3. GGbudget'!J7+1,1),\"0,0;–0,0\"),\" ir\n\",TEXT(ROUND(G38,1),\"0,0;–0,0\"),IF(G38-G39>=0.5,\" ≥ \",\" < \"),TEXT(ROUND(G39+0.5,1),\"0,0;–0,0\"))","v":"–0,2 < 1,0 ir\n–0,6 < –0,2"},null,null,null,null,{"$f":"CONCATENATE(TEXT(ROUND('3. GGbudget'!G7,1),\"0.0;–0.0\"),IF(('3. GGbudget'!G7>='3. GGbudget'!F7+1),\" ≥ \",\" < \"),TEXT(ROUND('3. GGbudget'!F7+1,1),\"0.0;–0.0\"),\" and\n\",TEXT(ROUND(L38,1),\"0.0;–0.0\"),IF(L38-L39>=0.5,\" ≥ \",\" < \"),TEXT(ROUND(L39+0.5,1),\"0.0;–0.0\"))","v":"00 < 01 and\n–01 < –00"},{"$f":"CONCATENATE(TEXT(ROUND('3. GGbudget'!K7,1),\"0.0;–0.0\"),IF(('3. GGbudget'!K7>='3. GGbudget'!J7+1),\" ≥ \",\" < \"),TEXT(ROUND('3. GGbudget'!J7+1,1),\"0.0;–0.0\"),\" and\n\",TEXT(ROUND(M38,1),\"0.0;–0.0\"),IF(M38-M39>=0.5,\" ≥ \",\" < \"),TEXT(ROUND(M39+0.5,1),\"0.0;–0.0\"))","v":"–00 < 01 and\n–01 < –00"}]
[null,"A3","Ne mažiau kaip penkerių iš eilės einančių metų VS balanso rodiklio aritmetinis vidurkis yra perteklius, ne mažesnis negu 0,1 procento BVP",null,null,{"$f":"IF(L12,\"Tiesa\",\"Netiesa\")","v":"Tiesa"},{"$f":"IF(M12,\"Tiesa\",\"Netiesa\")","v":"Tiesa"},"E3","The arithmetic average of GG sector balance indicator of at least five successive years is in surplus, at least 0.1 % of GDP",null,null,{"$f":"IF(ROUND(AVERAGE('2. Macro'!J37:N37),1)>=0.1,TRUE,FALSE)","v":true},{"$f":"IF(ROUND(AVERAGE('2. Macro'!J36:N36),1)>=0.1,TRUE,FALSE)","v":true}]
[null,null,null,null,null,{"$f":"CONCATENATE(TEXT(ROUND(AVERAGE('2. Macro'!J37:N37),1),\"0,0;–0,0\"),IF(L12,\" ≥ \",\" < \"),\"0,1\")","v":"0,2 ≥ 0,1"},{"$f":"CONCATENATE(TEXT(ROUND(AVERAGE('2. Macro'!J36:N36),1),\"0,0;–0,0\"),IF(M12,\" ≥ \",\" < \"),\"0,1\")","v":"0,2 ≥ 0,1"},null,null,null,null,{"$f":"CONCATENATE(TEXT(ROUND(AVERAGE('2. Macro'!J37:N37),1),\"0.0;–0.0\"),IF(L12,\" ≥ \",\" < \"),\"0.1\")","v":"00 ≥ 0.1"},{"$f":"CONCATENATE(TEXT(ROUND(AVERAGE('2. Macro'!J36:N36),1),\"0.0;–0.0\"),IF(M12,\" ≥ \",\" < \"),\"0.1\")","v":"00 ≥ 0.1"}]
[null,"A4","Keičiant einamųjų metų bet kurio iš VS priskiriamų biudžetų, kurių kiekvieno atskirai planuojami asignavimai viršija 3 procentus BVP to meto kainomis, pajamas ar išlaidas, pakeistas VS balansas nepablogės, palyginti su buvusiu prieš keitimą","B**(t–1) ≥ B(t–1)",null,"Netaikoma",{"$f":"F14","v":"Netaikoma"},"E4","If planned current year GG sector budgets, the planned appropriations of each of which exceed 3 % of GDP at current prices, are subject to amendment,  the adjusted aggregate balances of the GG budgets is not worse than the one before the amendment","B*(t–1) ≥ B(t–1)",null,"Not applied",{"$f":"L14","v":"Not applied"}]
[null,"A5","Pagal Vyriausybės arba jos įgaliotos institucijos viešai paskelbtą ekonominės raidos scenarijų, dėl kurio tvirtinimo kontrolės institucija paskelbė išvadą, apskaičiuotas produkcijos atotrūkis nuo potencialo planuojamais metais yra neigiamas","AP(t) < 0",null,{"$f":"IF(L15,\"Tiesa\",\"Netiesa\")","v":"Netiesa"},{"$f":"IF(M15,\"Tiesa\",\"Netiesa\")","v":"Netiesa"},"E5","The output gap for the planned year calculated on the basis of the economic development scenario, which is made public by the Government or its authorised institution and in regard to which the monitoring authority published its conclusion, is negative","OG(t) < 0",null,{"$f":"IF(L45+eps<0,TRUE,FALSE)","v":false},{"$f":"IF(M45+eps<0,TRUE,FALSE)","v":false}]
[null,null,null,null,null,{"$f":"CONCATENATE(TEXT(ROUND(L45,1),\"0,0;–0,0\"),IF(L15,\" < \",\" ≥ \"),FIXED(0,1))","v":"2,2 ≥ 0,0"},{"$f":"CONCATENATE(TEXT(ROUND(M45,1),\"0,0;–0,0\"),IF(M15,\" < \",\" ≥ \"),FIXED(0,1))","v":"2,7 ≥ 0,0"},null,null,null,null,{"$f":"CONCATENATE(TEXT(ROUND(L45,1),\"0.0;–0.0\"),IF(L15,\" < \",\" ≥ \"),FIXED(0,1))","v":"02 ≥ 0,0"},{"$f":"CONCATENATE(TEXT(ROUND(M45,1),\"0.0;–0.0\"),IF(M15,\" < \",\" ≥ \"),FIXED(0,1))","v":"03 ≥ 0,0"}]
[null,"A5*","A5, o prognozuojama vidutinė metinė infliacija, apskaičiuojama pagal suderintą vartotojų kainų indeksą, neviršija 3 procentų","AP(t) < 0 ir ΔSVKI(t) ≤ 3",null,{"$f":"IF(L17,\"Tiesa\",\"Netiesa\")","v":"Netiesa"},{"$f":"IF(M17,\"Tiesa\",\"Netiesa\")","v":"Netiesa"},"E5*","E5, and project annual inflation, estimated by harmonised index of consumer prices is not greater that 3 %","OG(t) < 0 and ΔHICP(t) ≤ 3",null,{"$f":"IF((F45+eps<0)*($F$46<=3),TRUE,FALSE)","v":false},{"$f":"IF((G45+eps<0)*($F$46<=3),TRUE,FALSE)","v":false}]
[null,null,null,null,null,{"$f":"CONCATENATE(TEXT(ROUND(L45,1),\"0,0;–0,0\"),IF(L15,\" < \",\" ≥ \"),FIXED(0,1), \" ir\n\", TEXT(ROUND($L$46,1),\"0,0;–0,0\"),IF(L46<=3,\" ≤ \",\" > \"), FIXED(3,1))","v":"2,2 ≥ 0,0 ir\n2,3 ≤ 3,0"},{"$f":"CONCATENATE(TEXT(ROUND(M45,1),\"0,0;–0,0\"),IF(M15,\" < \",\" ≥ \"),FIXED(0,1), \" ir\n\", TEXT(ROUND($L$46,1),\"0,0;–0,0\"),IF(L46<=3,\" ≤ \",\" > \"), FIXED(3,1))","v":"2,7 ≥ 0,0 ir\n2,3 ≤ 3,0"},null,null,null,null,{"$f":"CONCATENATE(TEXT(ROUND(L45,1),\"0.0;–0.0\"),IF($L$15,\" < \",\" ≥ \"),FIXED(0,1), \" and\n\", TEXT(ROUND($L$46,1),\"0.0;–0.0\"),IF(L46<=3,\" ≤ \",\" > \"), FIXED(3,1))","v":"02 ≥ 0,0 and\n02 ≤ 3,0"},{"$f":"CONCATENATE(TEXT(ROUND(M45,1),\"0.0;–0.0\"),IF($L$15,\" < \",\" ≥ \"),FIXED(0,1), \" and\n\", TEXT(ROUND($L$46,1),\"0.0;–0.0\"),IF(L46<=3,\" ≤ \",\" > \"), FIXED(3,1))","v":"03 ≥ 0,0 and\n02 ≤ 3,0"}]
[null,"A","t metais, VS išlaidų augimo ribojimo taisyklė netaikoma, kai susidaro bent viena iš A1–A5 aplinkybių",null,null,{"$f":"IF(L19=\"yes\",\"Taip\",\"Ne\")","v":"Taip"},{"$f":"IF(M19=\"yes\",\"Taip\",\"Ne\")","v":"Taip"},"E","at year t the GG expenditure growth limiting rule is not applied when at least one of the  E1–E5 escape clauses emerges",null,null,{"$f":"+IF((OR(L6=TRUE,L8=TRUE,L12=TRUE,L14=TRUE,L15=TRUE)),\"Yes\",\"No\")","v":"Yes"},{"$f":"+IF((OR(M6=TRUE,M8=TRUE,M12=TRUE,M14=TRUE,M15=TRUE)),\"Yes\",\"No\")","v":"Yes"}]
[null,null,null,null,null,{"$f":"IF(F19=\"TAIP\",IF(F60=1,CONCATENATE(\"Susidaro \",H55,H56,H57,H58,H59,\" aplinkybė\"),CONCATENATE(\"Susidaro \", IF(F55=1,CONCATENATE(H55,\" \"),\"\"),IF(F56=1,CONCATENATE(H56,\" \"),\"\"),IF(F57=1,CONCATENATE(H57,\" \"),\"\"),IF(F58=1,CONCATENATE(H58,\" \"),\"\"),IF(F59=1,CONCATENATE(H59,\" \"),\"\"),\"aplinkybės\")),\"Išimčių nėra\")","v":"Susidaro A3 aplinkybė"},{"$f":"IF(G19=\"TAIP\",IF(G60=1,CONCATENATE(\"Susidaro \",I55,I56,I57,I58,I59,\" aplinkybė\"),CONCATENATE(\"Susidaro \", IF(G55=1,CONCATENATE(I55,\" \"),\"\"),IF(G56=1,CONCATENATE(I56,\" \"),\"\"),IF(G57=1,CONCATENATE(I57,\" \"),\"\"),IF(G58=1,CONCATENATE(I58,\" \"),\"\"),IF(G59=1,CONCATENATE(I59,\" \"),\"\"),\"aplinkybės\")),\"Išimčių nėra\")","v":"Susidaro A3 aplinkybė"},null,null,null,null,{"$f":"IF(L19=\"YES\",IF(F60=1,CONCATENATE(\"Escape clause \",J55,J56,J57,J58,J59,\" emerges\"),CONCATENATE(\"Escape clauses \", IF(F55=1,CONCATENATE(J55,\" \"),\"\"),IF(F56=1,CONCATENATE(J56,\" \"),\"\"),IF(F57=1,CONCATENATE(J57,\" \"),\"\"),IF(F58=1,CONCATENATE(J58,\" \"),\"\"),IF(F59=1,CONCATENATE(J59,\" \"),\"\"),\"emerge\") ),\"There is no escape clauses\")","v":"Escape clause E3 emerges"},{"$f":"IF(M19=\"YES\",IF(G60=1,CONCATENATE(\"Escape clause \",K55,K56,K57,K58,K59,\" emerges\"),CONCATENATE(\"Escape clauses \", IF(G55=1,CONCATENATE(K55,\" \"),\"\"),IF(G56=1,CONCATENATE(K56,\" \"),\"\"),IF(G57=1,CONCATENATE(K57,\" \"),\"\"),IF(G58=1,CONCATENATE(K58,\" \"),\"\"),IF(G59=1,CONCATENATE(K59,\" \"),\"\"),\"emerge\") ),\"There is no escape clauses\")","v":"Escape clause E3 emerges"}]
[null,"Nr.","Taisyklė","Formulė",null,"Išvada",null,"No.","Rule","Formula",null,"Conclusion"]
[null,"T1","Metais t rengiant, tvirtinant ir keičiant VS priskiriamų biudžetų, kurių kiekvieno atskirai planuojami asignavimai viršija 3 proc. BVP to meto kainomis (CV, VSDF ir PSDF išlaidos), patvirtinimo įstatymų arba šių įstatymų pakeitimo įstatymų projektus, vadovaujamasi nuostata, kad tuo atveju, kai paskutinių penkerių pasibaigusių metų VS balanso rodiklių aritmetinis vidurkis yra neigiamas, šių biudžetų asignavimų (išskyrus ES finansinės paramos lėšas) visumos augimas turi būti ne didesnis negu 0,5 potencialaus BVP to meto kainomis daugiamečio augimo vidurkio","Jei ",null,{"$f":"IF((L19=\"YES\"),\"\",IF(L22,\"TIESA\",\"NETIESA\"))","v":""},{"$f":"IF((M19=\"YES\"),\"\",IF(M22,\"TIESA\",\"NETIESA\"))","v":""},"R1","At year t the preparation, approval and amendment of draft laws or their draft amending laws on approval of the budgets attributable to the GG sector the planned appropriations of each of which exceed 3 % of GDP (CG and SSF expenditure) at current prices shall rely on the provision that, in case where arithmetic average of GG sector balance indicators of the past five complete years is negative, the aggregate growth of the appropriations of these budgets (net of EU financial support) is not higher than 0.5 % of the average multi-annual growth rate of the potential GDP at current prices","If",null,{"$f":"IF((L19=\"YES\"),\"\",IF(AVERAGE('2. Macro'!I37:M37)+eps<0,TRUE,FALSE))","v":""},{"$f":"IF((M19=\"YES\"),\"\",IF(AVERAGE('2. Macro'!I36:M36)+eps<0,TRUE,FALSE))","v":""}]
[null,null,null,null,null,{"$f":"IF((L19=\"YES\"),\"\",CONCATENATE(TEXT(ROUND(AVERAGE('2. Macro'!I37:M37),1),\"0,0;–0,0\"),IF(L12,\" ≥ \",\" < \"),FIXED(0,1)))","v":""},{"$f":"IF((M19=\"YES\"),\"\",CONCATENATE(TEXT(ROUND(AVERAGE('2. Macro'!I37:M37),1),\"0,0;–0,0\"),IF(M12,\" ≥ \",\" < \"),FIXED(0,1)))","v":""},null,null,null,null,{"$f":"IF((L19=\"YES\"),\"\",CONCATENATE(TEXT(ROUND(AVERAGE('2. Macro'!I37:M37),1),\"0.0;–0.0\"),IF(L12,\" ≥ \",\" < \"),FIXED(0,1)))","v":""},{"$f":"IF((M19=\"YES\"),\"\",CONCATENATE(TEXT(ROUND(AVERAGE('2. Macro'!I36:M36),1),\"0.0;–0.0\"),IF(M12,\" ≥ \",\" < \"),FIXED(0,1)))","v":""}]
[null,null,null,null,null,{"$f":"L24","v":""},{"$f":"M24","v":""},null,null,null,null,{"$f":"IF(L19=\"YES\",\"\",POWER('2. Macro'!Q16/'2. Macro'!G16,0.1)*POWER(PRODUCT(F40:F43),0.25)-1)","v":""},{"$f":"IF(M19=\"YES\",\"\",POWER('2. Macro'!Q15/'2. Macro'!G15,0.1)*POWER(PRODUCT(F40:F43),0.25)-1)","v":""}]
[null,null,null,null,null,{"$f":"IF(F19=\"TAIP\",\"Netaikoma,\",IF(L25,\"Tiesa\",\"Netiesa\"))","v":"Netaikoma,"},{"$f":"IF(G19=\"TAIP\",\"Netaikoma,\",IF(M25,\"Tiesa\",\"Netiesa\"))","v":"Netaikoma,"},null,null,null,null,{"$f":"IF(L19=\"YES\",\"Not applied,\",IF($F$32-$F$34<=($F$33-$F$35)*(1+0.5*L24),TRUE,FALSE))","v":"Not applied,"},{"$f":"IF(M19=\"YES\",\"Not applied,\",IF($G$32-$F$34<=($G$33-$F$35)*(1+0.5*M24),TRUE,FALSE))","v":"Not applied,"}]
[null,null,null,null,null,{"$f":"IF(L19=\"YES\",\" nes susidarė viena iš KĮ numatytų netaikymo aplinkybių\",CONCATENATE(ROUND(($F$32-F34)/($F$33-F35),3),IF(L25,\" ≤ \",\" > \"), ROUND(1+0.5*L24,3)))","v":" nes susidarė viena iš KĮ numatytų netaikymo aplinkybių"},{"$f":"IF(M19=\"YES\",\" nes susidarė viena iš KĮ numatytų netaikymo aplinkybių\",CONCATENATE(ROUND(($G$32-F34)/($G$33-F35),3),IF(M25,\" ≤ \",\" > \"), ROUND(1+0.5*M24,3)))","v":" nes susidarė viena iš KĮ numatytų netaikymo aplinkybių"},null,null,null,null,{"$f":"IF(L19=\"YES\",\" since one of CL escape clauses emerged\",CONCATENATE(ROUND(($F$32-F34)/($F$33-F35),3),IF(L25,\" ≤ \",\" > \"), ROUND(1+0.5*L24,3)))","v":" since one of CL escape clauses emerged"},{"$f":"IF(M19=\"YES\",\" since one of CL escape clauses emerged\",CONCATENATE(ROUND(($G$32-F34)/($G$33-F35),3),IF(M25,\" ≤ \",\" > \"), ROUND(1+0.5*M24,3)))","v":" since one of CL escape clauses emerged"}]
[null,"T2","Pagal FDĮ panaši į T1 išlaidų ribojimo taisyklė turi būti pritaikyta visam konsoliduotam VS biudžetui (be Europos Sąjungos finansinės paramos lėšų)",null,null,{"$f":"IF(F19=\"TAIP\",\"Netaikoma,\",IF(L27,\"Tiesa\",\"Netiesa\"))","v":"Netaikoma,"},{"$f":"IF(G19=\"TAIP\",\"Netaikoma,\",IF(M27,\"Tiesa\",\"Netiesa\"))","v":"Netaikoma,"},"R2","According to FDL a similar to R1 GG consolidated budget's expenditure growth rule is applied (net of EU financial support) ",null,null,{"$f":"IF(L19=\"YES\",\"Not applied,\",IF($F$36-$F$34<=($F$37-$F$35)*(1+0.5*L24),TRUE,FALSE))","v":"Not applied,"},{"$f":"IF(M19=\"YES\",\"Not applied,\",IF($F$36-$F$34<=($F$37-$F$35)*(1+0.5*M24),TRUE,FALSE))","v":"Not applied,"}]
[null,null,null,null,null,{"$f":"IF(L19=\"YES\",\" nes susidarė viena iš FDĮ numatytų netaikymo aplinkybių\",CONCATENATE(ROUND(($F$36-$F$34)/($F$37-$F$35),3),IF(L25,\" ≤ \",\" > \"), ROUND(1+0.5*L24,3)))","v":" nes susidarė viena iš FDĮ numatytų netaikymo aplinkybių"},{"$f":"IF(M19=\"YES\",\" nes susidarė viena iš FDĮ numatytų netaikymo aplinkybių\",CONCATENATE(ROUND(($G$36-$F$34)/($G$37-$F$35),3),IF(M25,\" ≤ \",\" > \"), ROUND(1+0.5*M24,3)))","v":" nes susidarė viena iš FDĮ numatytų netaikymo aplinkybių"},null,null,null,null,{"$f":"IF(L19=\"YES\",\" since one of FDL escape clauses emerged\",CONCATENATE(ROUND(($F$36-$F$34)/($F$37-$F$35),3),IF(L25,\" ≤ \",\" > \"), ROUND(1+0.5*L24,3)))","v":" since one of FDL escape clauses emerged"},{"$f":"IF(M19=\"YES\",\" since one of FDL escape clauses emerged\",CONCATENATE(ROUND(($G$36-$F$34)/($G$37-$F$35),3),IF(M25,\" ≤ \",\" > \"), ROUND(1+0.5*M24,3)))","v":" since one of FDL escape clauses emerged"}]
[null,null,"* nelygybės ženklas yra griežtas, jei skirtumas tarp lyginamų pusių po apvalinimo sudaro bent 0,1, \nkitaip ženklas interpretuojamas kaip =\n** einamaisiais metais keičiamas VS balansas",null,null,null,null,null,"* inequality sign is strict, if a difference between both compared sides after rounding is at least 0,1, \n else the sign is interpreted as =\n** the adjusted aggregate balances of the GG budgets"]
[null,null,"Šaltiniai: KĮ 3 straipsnis 3 dalis, taisyklės pažymėtos * FDĮ 2-3 straipsniai",null,null,null,null,null,"Source: CL Article 3(3), rules denoted by * FDL Articles 2 and 3"]
[null,null,null,null,"t =",{"$f":"FirstYear+8","v":2020},null,null,null,null,"t =",{"$f":"F31","v":2020}]
[null,null,null,null,"AV3(t) =",{"$f":"'3. GGbudget'!I14","v":16338},{"$f":"'3. GGbudget'!M14","v":16995.431929795232},null,null,null,"AG3(t) =",16338,{"$f":"G32","v":16995.431929795232}]
[null,null,null,null,"AV3(t–1) =",{"$f":"'3. GGbudget'!H14","v":15081},{"$f":"'3. GGbudget'!L14","v":15538.192849230274},null,null,null,"AG3(t–1) =",15081,{"$f":"G33","v":15538.192849230274}]
[null,null,null,null,"ES(t) =",2242.6999999999998,null,null,null,null,"EU(t) =",2242.6999999999998]
[null,null,null,null,"ES(t–1) =",2101.1999999999998,null,null,null,null,"EU(t–1) =",2101.1999999999998]
[null,null,null,null,"VI(t) =",{"$f":"'3. GGbudget'!I11","v":18545.8},{"$f":"'3. GGbudget'!M11","v":18285.555859550957},null,null,null,"TE(t) =",18545.8,{"$f":"G36","v":18285.555859550957}]
[null,null,null,null,"VI(t–1) =",{"$f":"'3. GGbudget'!H11","v":17108.5},{"$f":"'3. GGbudget'!L11","v":16731.221093983859},null,null,null,"TE(t–1) =",17108.5,{"$f":"G37","v":16731.221093983859}]
[null,null,null,null,"B(t–1)–B(t–2) =",{"$f":"+'3. GGbudget'!F7-'2. Macro'!M37","v":-0.54398320957734136},{"$f":"+'3. GGbudget'!J7-'2. Macro'!M36","v":-0.58717233386617163},null,null,null,"B(t–1)–B(t–2) =",-0.54398320957734136,{"$f":"G38","v":-0.58717233386617163}]
[null,null,null,null,"BP(t–1)–BP(t–2) =",{"$f":"+('2. Macro'!N37-'2. Macro'!M37)-('2. Macro'!M37-'2. Macro'!L37)","v":-0.68916736120156474},{"$f":"+('2. Macro'!N36-'2. Macro'!M36)-('2. Macro'!M36-'2. Macro'!L36)","v":-0.73111105446026547},null,null,null,"BP(t–1)–BP(t–2) =",-0.68916736120156474,{"$f":"G39","v":-0.73111105446026547}]
[null,null,"2019 m. pavasario ERS",null,"PY1(t)/PY1(t–1) =",1.0224345863502,null,null,"Spring 2019 EDS",null,"PY1(t)/PY1(t–1) =",1.0224345863502]
[null,null,"2019 m. rudens ERS",null,"PY2(t)/PY2(t–1) =",1.0273725530397899,null,null,"Autumn 2019 EDS",null,"PY2(t)/PY2(t–1) =",1.0273725530397899]
[null,null,"2018 m. rudens EK projekcijos",null,"PY3(t)/PY3(t–1) =",1.036,null,null,"Autumn 2018 EC projections",null,"PY3(t)/PY3(t–1) =",1.036]
[null,null,"2019 m. pavasario EK projekcijos",null,"PY4(t)/PY4(t–1) =",1.0269999999999999,null,null,"Spring 2019 EC projections",null,"PY4(t)/PY4(t–1) =",1.0269999999999999]
[null,null,"2018K3-2019K2",null,"ΔYN(t–1) =",7.3534791586647046,7.2971198323839692,null,{"$f":"+C44","v":"2018K3-2019K2"},null,"ΔYN(t–1) =",{"$f":"F44","v":7.3534791586647046},{"$f":"G44","v":7.2971198323839692}]
[null,null,null,null,"AP(t)  =",{"$f":"'2. Macro'!O20","v":2.2001854638479479},{"$f":"'2. Macro'!O19","v":2.7273081562109613},null,null,null,"OG(t) =",2.2001854638479479,{"$f":"G45","v":2.7273081562109613}]
[null,null,null,null,"ΔSVKI(t) =",{"$f":"'2. Macro'!O31","v":2.2999999999999998},null,null,null,null," ΔHICP(t) =",2.2999999999999998]
[null,null,null,null,"AV3(t)–ES(t)=",{"$f":"+F32-F34","v":14095.3},{"$f":"+G32-F34","v":14752.731929795231},null,null,null,"AG3(t)–EU(t)=",{"$f":"+F47","v":14095.3},14752.731929795231]
[null,null,null,null,"AV3(t–1)–ES(t–1)=",{"$f":"+F33-F35","v":12979.8},{"$f":"+G33-F35","v":13436.992849230275},null,null,null,"AG3(t–1)–EU(t–1)=",12979.8,13436.992849230275]
[null,null,null,null,"(AV3(t)-ES(t))/(AV3(t-1)-ES(t-1))=",{"$f":"+(F47/F48-1)*100","v":8.5941231760119585},{"$f":"+(G47/G48-1)*100","v":9.7919162072064747},null,null,null,"(AG3(t)-EU(t))/(AG3(t-1)-EU(t-1))=",8.5941231760119585,9.7919162072064747]
[null,null,null,null,"Ynp10t",{"$f":"(POWER('2. Macro'!Q16/'2. Macro'!G16,0.1)*POWER(PRODUCT(F40:F43),0.25)-1)*100","v":5.5225944577436126},{"$f":"(POWER('2. Macro'!Q15/'2. Macro'!G15,0.1)*POWER(PRODUCT(F40:F43),0.25)-1)*100","v":5.5338583112430895},null,null,null,"Ynp10t",{"$f":"+F50","v":5.5225944577436126},{"$f":"+G50","v":5.5338583112430895}]
[null,null,null,null,"Šaltiniai:",null,null,null,null,null,"Sources:"]
[null,null,null,null,"Finansų ministerija","FM",null,null,null,null,"Ministry of Finance","MoF"]
[null,null,null,null,"Fiskalinė institucija","IFI",null,null,null,null,"Independent Fiscal Institution","IFI"]
[null,null,null,null,"Europos Komisija","EK",null,null,null,null,"European Commission","EC"]
[null,null,null,"A1","E1",{"$f":"(L6)*1","v":0},{"$f":"(M6)*1","v":0},{"$f":"IF(F55=1,$D55,\"\")","v":""},"",{"$f":"IF(F55=1,$E55,\"\")","v":""},""]
[null,null,null,"A2","E2",{"$f":"(L8)*1","v":0},{"$f":"(M8)*1","v":0},"","","",""]
[null,null,null,"A3","E3",{"$f":"(L12)*1","v":1},{"$f":"(M12)*1","v":1},"A3","A3","E3","E3"]
[null,null,null,"A4","E4",{"$f":"(L14)","v":"Not applied"},{"$f":"(M14)","v":"Not applied"},"","","",""]
[null,null,null,"A5","E5",{"$f":"(L15)*1","v":0},{"$f":"(M15)*1","v":0},"","","",""]
[null,null,null,null,null,{"$f":"SUM(F55:F59)","v":1},{"$f":"SUM(G55:G59)","v":1}]

{"sheet":"7. GGbudgets","index":8,"n_rows":31,"n_cols":11,"rows_kept":31,"cut":false,"hidden":false,"merged":[[5,1,7,1],[7,2,7,3],[7,7,7,8],[18,1,21,1],[18,6,21,6],[21,2,21,3],[8,1,11,1],[8,6,11,6],[8,7,10,7],[8,4,8,5],[5,9,5,10],[13,3,14,3],[15,3,16,3],[19,5,20,5],[19,9,20,9],[19,10,20,10],[17,2,17,3],[15,8,16,8],[13,8,14,8],[5,4,5,5],[12,4,12,5],[5,7,6,7],[12,7,16,7],[12,6,17,6],[18,2,20,2],[11,7,11,8],[0,1,0,2],[12,1,17,1],[3,6,4,6],[5,2,6,2],[12,2,16,2],[2,6,2,10],[2,1,2,5],[3,1,4,1],[0,6,0,7],[4,2,4,3],[4,7,4,8],[3,4,3,5],[3,9,3,10],[5,6,6,6],[12,9,12,10],[11,2,11,3],[8,9,8,10],[8,2,10,2],[9,3,10,3],[9,8,10,8],[30,4,30,5],[29,9,29,10],[30,9,30,10],[21,7,21,8],[17,7,17,8],[29,4,29,5],[23,9,23,10],[23,4,23,5],[18,4,18,5],[18,9,18,10],[18,7,20,7],[19,4,20,4]]}
[null,"↖ atgal į turinį ",null,null,null,null,"↖ back to content"]
[{"$f":"Kalba","v":"LT"}]
[null,"7 lentelė. VS priskiriamų biudžetų taisyklės",null,null,null,null,"Table 7. Rules for the budgets attributable to GG sector"]
[null,"Nr.","Taisyklė","Formulė","Išvada",null,"No.","Rule","Formula","Conclusion"]
[null,null,"Institucija, kurios projekcijų pagrindu atliekama analizė",null,"FM","IFI",null,"Institution, projections of which are used for the analysis",null,"MoF","IFI"]
[null,"T31","Nuo 2018 m. sausio 1 d. kiekvienas j-asis vietos valdžios sektoriui priskiriamas biudžetas, kurio asignavimai viršija 0,3 procentą praėjusių metų BVP to meto kainomis, turi būti planuojamas, tvirtinamas, keičiamas ir vykdomas taip, kad, sprendžiant pagal to biudžeto struktūrinį balanso rodiklį, apskaičiuotą kaupiamuoju principu, jis būtų perteklinis arba subalansuotas","t > 2018",{"$f":"IF(J6,\"Tiesa\",\"Netiesa\")","v":"Tiesa"},null,"R31","From 1 January 2018 each j-th budget attributable to local government sector, planned appropriations of which exceeds 0.3 % of GDP in the preceding year at current prices, and NHIF budget must be planned, approved, amended and implemented to be in surplus or balanced when judged by its structural balance indicator calculated on accrual basis","t > 2018",{"$f":"IF((J24-1)>2018,TRUE,FALSE)","v":true}]
[null,null,null,"SBj(t) ≥ 0, ꓯj","Šiuo metu negalima patikrinti, nes nėra duomenų apie savivaldybių, kurių asignavimai viršija 0,3 proc. BVP, planuojamus struktūrinius balanso rodiklius.\nVertinama ex-ante 2020 m. I pusmetį.","Šiuo metu negalima patikrinti, nes nėra duomenų apie savivaldybių, kurių asignavimai viršija 0,3 proc. BVP, planuojamus struktūrinius balanso rodiklius.\nVertinama ex-ante 2020 m. I pusmetį.",null,null,"SBj(t) ≥ 0, ꓯj","Assessed ex-ante in the first half of 2020","Assessed ex-ante in the first half of 2020"]
[null,null,"Taisyklė planuojamiems vietos valdžios sektoriaus (j) asignavimams, kurie viršija 0,3 proc. BVP",null,"Netikrinama","Netikrinama",null,"Rule for planned local governments (j) appropriations of which does exceed 0.3 % of GDP",null,"Not verified","Not verified"]
[null,"T32","Nuo 2018 m. sausio 1 d. PSDF biudžetas turi būti planuojamas, tvirtinamas, keičiamas ir vykdomas taip, kad, sprendžiant pagal to biudžeto struktūrinį balanso rodiklį, apskaičiuotą kaupiamuoju principu, jis būtų perteklinis arba subalansuotas","t > 2018",{"$f":"IF(J9,\"Tiesa\",\"Netiesa\")","v":"Tiesa"},null,"R32","From 1 January 2019 NHIF budget must be planned, approved, amended and implemented to be in surplus or balanced when judged by its structural balance indicator calculated on accrual basis","t > 2018",{"$f":"IF(E24>2018,TRUE,FALSE)","v":true}]
[null,null,null,"SBPSDF(t) ≥ 0",{"$f":"IF(J10,\"Tiesa\",\"Netiesa\")","v":"Tiesa"},{"$f":"IF(J10,\"Tiesa\",\"Netiesa\")","v":"Tiesa"},null,null,"SBNHIF ≥ 0",{"$f":"IF(J28>=0,TRUE,FALSE)","v":true},{"$f":"IF(K28>=0,TRUE,FALSE)","v":true}]
[null,null,null,null,{"$f":"CONCATENATE(TEXT(ROUND(J28,1),\"0,0;–0,0\"),IF(J28>= 0,\" ≥ \",\" < \"),FIXED(0,1))","v":"0,3 ≥ 0,0"},{"$f":"CONCATENATE(TEXT(ROUND(K28,1),\"0,0;–0,0\"),IF(K28>=0,\" ≥ \",\" < \"),FIXED(0,1))","v":"0,3 ≥ 0,0"},null,null,null,{"$f":"CONCATENATE(TEXT(ROUND(J28,1),\"0.0;–0.0\"),IF(J28>=0,\" ≥ \",\" < \"),FIXED(0,1))","v":"00 ≥ 0,0"},{"$f":"CONCATENATE(TEXT(ROUND(K28,1),\"0.0;–0.0\"),IF(K28>=0,\"≥ \",\" <\"),FIXED(0,1))","v":"00≥ 0,0"}]
[null,null,"Taisyklė planuojamam PSDF struktūriniam biudžetui",null,{"$f":"IF(J10,\"Galioja\",\"Negalioja\")","v":"Galioja"},{"$f":"IF(K10,\"Galioja\",\"Negalioja\")","v":"Galioja"},null,"Rule for NHIF structural budget",null,{"$f":"IF(OR(J10:J11),\"Valid\",\"Invalid\")","v":"Valid"},{"$f":"IF(OR(K10:K11),\"Valid\",\"Invalid\")","v":"Valid"}]
[null,"T4","Nuo 2016 m. sausio 1 d. Lietuvos Respublikos atitinkamų metų VSDF biudžetas planuojamas, tvirtinamas, keičiamas ir vykdomas taip, kad jo struktūrinis deficitas, apskaičiuotas kaupiamuoju principu, galėtų didėti t metais, kuriems pagal Vyriausybės arba jos įgaliotos institucijos viešai paskelbtą ekonominės raidos scenarijų, dėl kurio tvirtinimo kontrolės institucija paskelbė savo išvadą, numatomas neigiamas produkcijos atotrūkis nuo potencialo","t > 2016",{"$f":"IF(J13,\"Tiesa\",\"Netiesa\")","v":"Tiesa"},null,"R3","From 1 January 2016 budget of the SSIF of the Republic of Lithuania for a year t shall be planned, approved, amended and implemented in such a way that its structural deficit calculated on accrual basis could increase only in the year when a negative output gap is projected according to the economic development scenario which is made public by the Government of the Republic of Lithuania or its authorised institutions and in regard of which the monitoring authority published its conclusion","t > 2016",{"$f":"IF(E24>2016,TRUE,FALSE)","v":true}]
[null,null,null,"AP(t) < 0",{"$f":"IF(J14,\"Tiesa\",\"Netiesa\")","v":"Netiesa"},{"$f":"IF(K14,\"Tiesa\",\"Netiesa\")","v":"Netiesa"},null,null,"OG(t) < 0 ",{"$f":"IF(J25+eps<0,TRUE,FALSE)","v":false},{"$f":"IF(K25+eps<0,TRUE,FALSE)","v":false}]
[null,null,null,null,{"$f":"CONCATENATE(TEXT(ROUND(J25,1),\"0,0;–0,0\"),IF(J25<0,\" < \",\" ≥ \"),FIXED(0,1))","v":"2,2 ≥ 0,0"},{"$f":"CONCATENATE(TEXT(ROUND(K25,1),\"0,0;–0,0\"),IF(K25<0,\" < \",\" ≥ \"),FIXED(0,1))","v":"2,7 ≥ 0,0"},null,null,null,{"$f":"CONCATENATE(TEXT(ROUND(J25,1),\"0.0;–0.0\"),IF(J25<0,\" < \",\" ≥ \"),FIXED(0,1))","v":"02 ≥ 0,0"},{"$f":"CONCATENATE(TEXT(ROUND(K25,1),\"0.0;–0.0\"),IF(K25<0,\" < \",\" ≥ \"),FIXED(0,1))","v":"03 ≥ 0,0"}]
[null,null,null,"AP(t) ≥ 0 \nir\nSBVSDF(t) ≥ SBVSDF(t–1)\narba SBVSDF(t) ≥ 0",{"$f":"IF(J16,\"Tiesa\",\"Netiesa\")","v":"Tiesa"},{"$f":"IF(K16,\"Tiesa\",\"Netiesa\")","v":"Tiesa"},null,null,"OG(t) ≥ 0 and\nSBSSIF(t) ≥ SBSSIF(t–1)",{"$f":"IF((J25>=0)*(J26>=0),TRUE,FALSE)","v":true},{"$f":"IF((K25>=0)*(K26+eps>=0),TRUE,FALSE)","v":true}]
[null,null,null,null,{"$f":"CONCATENATE(TEXT(ROUND(E25,1),\"0,0;–0,0\"),IF(J25<0, \" < \",\" ≥ \"),FIXED(0,1), \" ir\n\", TEXT(ROUND(E26,1),\"0,0;–0,0\"),IF(E26>=0,\" ≥ \",\" < \"), TEXT(ROUND(0,1),\"0,0;–0,0\"))","v":"2,2 ≥ 0,0 ir\n0,5 ≥ 0,0"},{"$f":"CONCATENATE(TEXT(ROUND(F25,1),\"0,0;–0,0\"),IF(K25<0, \" < \", \" ≥ \"),FIXED(0,1), \" ir\n\", TEXT(ROUND(F26,1),\"0,0;–0,0\"),IF(F26>=0,\" ≥ \",\" < \"), TEXT(ROUND(0,1),\"0,0;–0,0\"))","v":"2,7 ≥ 0,0 ir\n0,3 ≥ 0,0"},null,null,null,{"$f":"CONCATENATE(TEXT(ROUND(J25,1),\"0.0;–0.0\"),IF(J25 <0, \" < \",\" ≥ \"),FIXED(0,1), \" and\n\", TEXT(ROUND(J26,1),\"0.0;–0.0\"),IF(J26>=0,\" ≥ \",\" < \"), TEXT(ROUND(0,1),\"0.0;–0.0\"))","v":"02 ≥ 0,0 and\n01 ≥ 00"},{"$f":"CONCATENATE(TEXT(ROUND(K25,1),\"0.0;–0.0\"),IF(K25 <0, \" < \",\" ≥ \"),FIXED(0,1), \" and\n\", TEXT(ROUND(K26,1),\"0.0;–0.0\"),IF(K26+eps>=0,\" ≥ \",\" < \"), TEXT(ROUND(0,1),\"0.0;–0.0\"))","v":"03 ≥ 0,0 and\n00 ≥ 00"}]
[null,null,"Taisyklė planuojamam VSDF struktūriniam biudžetui",null,{"$f":"IF(OR(J14,J16),\"Galioja\",\"Negalioja\")","v":"Galioja"},{"$f":"IF(OR(K14,K16),\"Galioja\",\"Negalioja\")","v":"Galioja"},null,"Rule for SSIF structural budget",null,{"$f":"IF(OR(J14:J16),\"Valid\",\"Invalid\")","v":"Valid"},{"$f":"IF(OR(K14:K16),\"Valid\",\"Invalid\")","v":"Valid"}]
[null,"T5","Nuo 2016 m. sausio 1 d.  kiekvienas j-asis vietos valdžios sektoriui priskiriamas biudžetas, kurio asignavimai neviršija 0,3 procento praėjusių metų BVP to meto kainomis, turi būti planuojamas, tvirtinamas, keičiamas ir vykdomas taip, kad to biudžeto asignavimai neviršytų jo pajamų, išskyrus metus, kuriais pagal Vyriausybės arba jos įgaliotos institucijos viešai paskelbtą ekonominės raidos scenarijų, dėl kurio tvirtinimo kontrolės institucija paskelbė savo išvadą, numatomas neigiamas produkcijos atotrūkis nuo potencialo. Pastaruoju atveju asignavimai negali viršyti pajamų daugiau kaip 1,5 procento","t > 2016",{"$f":"IF(J19,\"Tiesa\",\"Netiesa\")","v":"Tiesa"},null,"R4","From 1 January 2016 each j-th budget attributable to local government sector, planned appropriations of which does not exceed 0.3 % of GDP in the preceding year at current prices, shall be planned, approved, amended and implemented in such a way that the appropriations of the budget would not exceed its revenue, with the exception of the year when a negative output gap is projected according to the economic development scenario which is made public by the Government or its authorised institution and in regard to which the monitoring authority published its conclusion. In the latter case, the appropriations may not exceed revenue by more than 1.5 %","t>2016",{"$f":"IF(E24>2016,TRUE,FALSE)","v":true}]
[null,null,null,"AP(t) ≥ 0 ir \nVIj(t)/VPj(t) ≤ 1","Šiuo metu negalima patikrinti, nes nėra duomenų apie savivaldybių, kurių asignavimai neviršija 0,3 proc. BVP, planuojamas pajamas ir asignavimus. Vertinama ex-ante 2020 m. I pusmetį.","Šiuo metu negalima patikrinti, nes nėra duomenų apie savivaldybių, kurių asignavimai neviršija 0,3 proc. BVP, planuojamas pajamas ir asignavimus. Vertinama ex-ante 2020 m. I pusmetį.",null,null,"OG(t) ≥ 0 and\nTEj(t)/TRj(t) ≤ 1","Assessed ex-ante in the first half of 2020","Assessed ex-ante in the first half of 2020"]
[null,null,null,"AP(t) < 0 ir \nVIj(t)/VPj(t) ≤ 1,015",null,null,null,null,"OG(t) < 0 and \nTEj(t)/TRj(t) ≤ 1,015"]
[null,null,"Taisyklė planuojamiems vietos valdžios sektoriaus (j) asignavimams, kurie neviršija 0,3 proc. BVP",null,"Netikrinama","Netikrinama",null,"Rule for planned local governments (j) appropriations of which does not exceed 0.3 % of GDP",null,"Not verified","Not verified"]
[null,null,"Šaltinis: KĮ 4 straipsnis",null,null,null,null,"Source: CL Article 4"]
[null,null,null,"t =",{"$f":"'2. Macro'!G5+8","v":2020},null,null,null,"t =",{"$f":"E24","v":2020}]
[null,null,null,"AP(t) =",{"$f":"'2. Macro'!O20","v":2.2001854638479479},{"$f":"'2. Macro'!O19","v":2.7273081562109613},null,null,"OG(t) =",{"$f":"E25","v":2.2001854638479479},{"$f":"F25","v":2.7273081562109613}]
[null,null,null,"SBVSDF(t) =",{"$f":"'3. GGbudget'!G20","v":0.46150019363937012},{"$f":"'3. GGbudget'!K20","v":0.29734593293341899},null,null,"SBSSIF(t) =",{"$f":"E26","v":0.46150019363937012},{"$f":"F26","v":0.29734593293341899}]
[null,null,null,"SBVSDF(t–1) =",{"$f":"'3. GGbudget'!F20","v":0.45529825658408696},{"$f":"'3. GGbudget'!J20","v":0.36636434795634892},null,null,"SBSSIF(t–1) =",{"$f":"E27","v":0.45529825658408696},{"$f":"F27","v":0.36636434795634892}]
[null,null,null,"SBPSDF(t) =",{"$f":"+'3. GGbudget'!G21","v":0.29500614509096207},{"$f":"+'3. GGbudget'!K21","v":0.26978633567557708},null,null,"SBNHIF(t) =",{"$f":"E28","v":0.29500614509096207},{"$f":"F28","v":0.26978633567557708}]
[null,null,null,"Šaltiniai:",null,null,null,null,"Sources:"]
[null,null,null,"Finansų ministerija","FM",null,null,null,"Ministry of Finance","MoF"]
[null,null,null,"Fiskalinė institucija","IFI",null,null,null,"Independent Fiscal Institution","IFI"]