{"text_format":"1","workbook":"xlsx","n_sheets":8,"sheets":["Tech","Content","1. Summary","2. Macro","3. GGbudget","5. SurplusGG","6. GGexpenditure","7. GGbudgets"],"not_rendered":{"charts":0,"images":2,"macros":1,"external_links":0,"defined_names":8,"comments":2,"pivot_tables":0},"unopened":[],"bounds":{"document_bytes":16777216,"sheet_cells":100000,"rows_first":2000,"rows_last":500,"rows_between":2000,"halvings":0,"cell_chars":16384,"cell_head_chars":4096},"cells_cut":0,"cells_raw":0,"read":"whole","date_system":"1900"}

{"sheet":"Tech","index":0,"n_rows":2,"n_cols":1,"rows_kept":2,"cut":false,"hidden":true,"merged":[]}
["LT"]
["EN"]

{"sheet":"Content","index":1,"n_rows":31,"n_cols":7,"rows_kept":31,"cut":false,"hidden":false,"merged":[[11,5,11,7],[15,5,15,7],[21,5,21,7],[27,5,27,7],[0,2,0,4],[27,2,27,3],[11,2,11,3],[15,2,15,3],[21,2,21,3],[5,2,5,3],[7,2,7,3],[3,2,3,3],[3,5,3,7],[7,5,7,7]]}
[]
[null,"LT","◄","Switch to English",null,"◄","Rodyti lietuviškai"]
[]
[null,null,"FISKALINĖS DRAUSMĖS TAISYKLIŲ LAIKYMOSI SKAIČIUOKLĖ",null,null,"SPREADSHEET OF THE FULFILMENT OF FISCAL DISCIPLINE RULES  "]
[]
[null,null,"2020-05-15 BPE-3",null,null,null,"2020-05-15 BPE-3"]
[]
[null,null,"APRAŠYMAS",null,null,"DESCRIPTION"]
[]
[null,null,null,"Fiskalinės sutarties įgyvendinimo konstituciniame įstatyme Nr. XII-1289 (toliau − KĮ) nustatytų fiskalinės drausmės taisyklių skaičiuoklė skirta skaidriai parodyti fiskalinės drausmės taisykles, pagal kurias priimami sprendimai. 1 dalis pateikia skaičiavimams reikalingų duomenų įvestis ir nurodo šių duomenų šaltinius. 2 dalyje nagrinėjamos trys taisyklių grupės: perteklinio valdžios sektoriaus (toliau − VS) taisyklė; VS išlaidų augimą ribojimo taisyklė ir VS priskiriamų biudžetų taisyklės.",null,null,"Constitutional Law on the Implementation of the Fiscal Treaty Nr. XII-1289 (hereinafter − CL) defines fiscal discipline rules. The aim of this spreadsheet is to show the fiscal discipline rules, which are used for making decisions in a transparent way.  Part 1 provides required input data with their appropriate sources. In part 2 three groups of the fiscal rules are validated: general government (hereinafter − GG) surplus rule; GG sector expenditure growth limiting rule and rules for the budgets attributable to GG.   "]
[]
[null,null,"SUVESTINĖ",null,null,"SUMMARY"]
[]
[null,null,null,"1 lentelė. Fiskalinės drausmės taisyklių laikymosi suvestinė",null,null,"Table 1. Summary of the fulfilment of the fiscal discipline rules "]
[]
[null,null,"1. DUOMENYS",null,null,"1 . DATA"]
[]
[null,null,null,"2 lentelė. Makroekonominiai ir ciklo rodikliai",null,null,"Table 2. Macroeconomic and cyclical indicators"]
[null,null,null,"3 lentelė. VS fiskaliniai rodikliai",null,null,"Table 3. GG fiscal indicators"]
[null,null,null,"4 lentelė. Savivaldybių biudžetai",null,null,"Table 4. Budget attributable to local government"]
[]
[null,null,"2. FISKALINĖS TAISYKLĖS",null,null,"2. FISCAL RULES"]
[]
[null,null,null,"5 lentelė. Perteklinio VS taisyklė",null,null,"Table 5. Surplus GG rule"]
[null,null,null,"6 lentelė. VS išlaidų augimo ribojimo taisyklė",null,null,"Table 6. GG expenditure growth limiting rule"]
[null,null,null,"7 lentelė. VS priskiriamų biudžetų taisyklė",null,null,"Table 7. Rules for the budgets attributable to GG sector"]
[]
[null,null,"NUORODOS",null,null,"REFERENCES"]
[]
[null,null,"KĮ","Lietuvos Respublikos fiskalinės sutarties įgyvendinimo konstitucinis įstatymas",null,"CL","Republic of Lithuania Constitutional Law on the Implementation of the Fiscal Treaty"]
[null,null,"FDĮ","Lietuvos Respublikos fiskalinės drausmės įstatymas",null,"FDL","Republic of Lithuania Fiscal Discipline Law"]

{"sheet":"1. Summary","index":2,"n_rows":24,"n_cols":7,"rows_kept":24,"cut":false,"hidden":false,"merged":[[23,2,23,3],[8,2,8,3],[8,5,8,6],[22,2,22,3],[15,4,15,6],[9,4,9,6],[10,4,11,4],[23,5,23,6],[22,5,22,6],[0,4,0,5],[20,1,20,3],[5,1,5,3],[9,1,9,3],[15,1,15,3],[2,1,2,3],[10,1,11,1],[6,1,7,1],[2,4,2,6],[5,4,5,6],[6,4,7,4]]}
[null,"↖ atgal į turinį",null,null,"↖ back to content"]
[{"$f":"Kalba","v":"LT"}]
[null,"1 lentelė. Fiskalinės drausmės taisyklių laikymosi suvestinė 2018 m.",null,null,"Table 1. Summary of the fulfilment of the fiscal discipline rules in year 2018"]
[null,"Taisyklė",null,null,"Rule"]
[null,"Institucija, kurios projekcijų pagrindu atliekama analizė","FM","IFI","Institution, projections of which are used for the analysis","MoF","IFI"]
[null,"Perteklinio VS taisyklė",null,null,"Surplus GG sector rule"]
[null,"Ar patenkinta bent viena perteklinio VS taisyklės sąlygų? ",{"$f":"'5. SurplusGG'!E14","v":"Ne"},{"$f":"'5. SurplusGG'!F14","v":"Ne"},"Is at least one condition of the surplus GG rule satisfied?",{"$f":"'5. SurplusGG'!J14","v":"No"},{"$f":"'5. SurplusGG'!K14","v":"No"}]
[null,null,{"$f":"'5. SurplusGG'!E15","v":"Netenkinama nei viena iš sąlygų"},{"$f":"'5. SurplusGG'!F15","v":"Netenkinama nei viena iš sąlygų"},null,{"$f":"'5. SurplusGG'!J15","v":"None of the conditions is valid"},{"$f":"'5. SurplusGG'!K15","v":"None of the conditions is valid"}]
[null,"Ar t metai yra išskirtinių aplinkybių metai?","Ne",null,"Is year t a year of exceptional circumstances?",{"$f":"IF(C9=\"NE\",\"No\",\"Yes\")","v":"No"}]
[null,"VS išlaidų augimo ribojimo taisyklė",null,null,"GG expenditure growth limiting rule"]
[null,"Ar susidaro bent viena aplinkybė, leidžianti netaikyti VS išlaidų augimo ribojimo taisyklės?",{"$f":"'6. GGexpenditure'!F19","v":"Taip"},{"$f":"'6. GGexpenditure'!G19","v":"Taip"},"Is at least one escape clause, which allows switching off GG expenditure growth limiting rule, valid?",{"$f":"'6. GGexpenditure'!L19","v":"Yes"},{"$f":"'6. GGexpenditure'!M19","v":"Yes"}]
[null,null,{"$f":"'6. GGexpenditure'!F20","v":"Susidaro aplinkybės"},{"$f":"'6. GGexpenditure'!G20","v":"Susidaro aplinkybės"},null,{"$f":"'6. GGexpenditure'!L20","v":"Escape clauses emerge"},{"$f":"'6. GGexpenditure'!M20","v":"Escape clauses emerge"}]
[null,"Ar taikoma VS išlaidų augimą ribojimo taisyklė?",{"$f":"IF(C11=\"taip\",\"Netaikoma,\",\"Taikoma\")","v":"Netaikoma,"},{"$f":"IF(D11=\"taip\",\"Netaikoma,\",\"Taikoma\")","v":"Netaikoma,"},"Is GG expenditure growth limiting rule applied?",{"$f":"IF(F11=\"yes\",\"Not applied\",\"Applied\")","v":"Not applied"},{"$f":"IF(G11=\"yes\",\"Not applied,\",\"Applied\")","v":"Not applied,"}]
[null,null,{"$f":"'6. GGexpenditure'!F26","v":" nes susidarė viena iš KĮ numatytų netaikymo aplinkybių"},{"$f":"'6. GGexpenditure'!G26","v":" nes susidarė viena iš KĮ numatytų netaikymo aplinkybių"},null,{"$f":"'6. GGexpenditure'!L26","v":" since one of CL escape clauses emerged"},{"$f":"'6. GGexpenditure'!M26","v":" since one of CL escape clauses emerged"}]
[null,"Ar galioja VS išlaidų augimo ribojimo taisyklė?",{"$f":"IF(C11=\"taip\",\"Netikrinama\",'6. GGexpenditure'!F25)","v":"Netikrinama"},{"$f":"IF(D11=\"taip\",\"Netikrinama\",'6. GGexpenditure'!G25)","v":"Netikrinama"},"Is GG expenditure growth limiting rule valid?",{"$f":"IF(F11=\"yes\",\"Not verified\",'6. GGexpenditure'!L25)","v":"Not verified"},{"$f":"IF(G11=\"yes\",\"Not verified\",'6. GGexpenditure'!M25)","v":"Not verified"}]
[null,"VS priskiriamų biudžetų taisyklės",null,null,"Rules for the budgets attributable to GG sector"]
[null,"Savivaldybių (j), kurių asignavimai didesni nei 0,3 proc. nominalaus BVP, struktūrinio biudžeto (SB) taisyklė",{"$f":"'7. GGbudgets'!E7","v":"Savivaldybių biudžetų atitiktis fiskalinės drausmės taisyklėms bus vertinama 2020 m. birželį"},{"$f":"'7. GGbudgets'!F7","v":"Savivaldybių biudžetų atitiktis fiskalinės drausmės taisyklėms bus vertinama 2020 m. birželį"},"Structural budget rule for local governments (j) with appropriations  exceeding 0,3 % of nominal GDP",{"$f":"'7. GGbudgets'!J7","v":"Will be assessed in June 2020"},{"$f":"'7. GGbudgets'!K7","v":"Will be assessed in June 2020"}]
[null,{"$f":"'7. GGbudgets'!C12","v":"Taisyklė PSDF struktūriniam biudžetui"},{"$f":"'7. GGbudgets'!E12","v":"Netenkinama"},{"$f":"'7. GGbudgets'!F12","v":"Netenkinama"}]
[null,{"$f":"'7. GGbudgets'!C18","v":"Taisyklė VSDF struktūriniam biudžetui"},{"$f":"'7. GGbudgets'!E18","v":"Tenkinama"},{"$f":"'7. GGbudgets'!F18","v":"Tenkinama"},{"$f":"'7. GGbudgets'!H18","v":"Rule for SSIF structural budget"},{"$f":"'7. GGbudgets'!J18","v":"Invalid"},{"$f":"'7. GGbudgets'!K18","v":"Invalid"}]
[null,{"$f":"'7. GGbudgets'!C22","v":"Taisyklė savivaldybių (j) asignavimams, kurie neviršija 0,3 proc. BVP"},{"$f":"'7. GGbudgets'!E20:E21","v":"Savivaldybių biudžetų atitiktis fiskalinės drausmės taisyklėms bus vertinama 2020 m. birželį"},{"$f":"'7. GGbudgets'!F20:F21","v":"Savivaldybių biudžetų atitiktis fiskalinės drausmės taisyklėms bus vertinama 2020 m. birželį"},{"$f":"'7. GGbudgets'!H22","v":"Rule for local governments (j) appropriations of which does not exceed 0.3 % of GDP"},{"$f":"'7. GGbudgets'!J20:J21","v":"Will be assessed in June 2020"},{"$f":"'7. GGbudgets'!K20:K21","v":"Will be assessed in June 2020"}]
[]
[null,"Šaltiniai:",null,null,"Sources:"]
[null,"Finansų ministerija","FM",null,"Ministry of Finance","MoF"]
[null,"Fiskalinė institucija","IFI",null,"Independent Fiscal Institution","IFI"]

{"sheet":"2. Macro","index":3,"n_rows":48,"n_cols":18,"rows_kept":48,"cut":false,"hidden":false,"merged":[[35,2,36,2],[28,2,29,2],[35,3,36,3],[28,4,29,4],[35,4,36,4],[33,2,34,2],[33,3,34,3],[33,4,34,4],[28,1,29,1],[16,1,17,1],[12,1,13,1],[22,1,23,1],[35,1,36,1],[33,1,34,1],[26,2,27,2],[22,2,23,2],[10,1,11,1],[8,1,9,1],[6,1,7,1],[26,1,27,1],[24,1,25,1],[24,2,25,2],[0,3,0,4],[20,1,21,1],[20,2,21,2],[14,1,15,1],[14,2,15,2],[18,1,19,1],[18,2,19,2],[16,2,17,2],[16,3,17,3],[12,2,13,2],[10,2,11,2],[8,2,9,2],[6,2,7,2],[3,1,4,1],[6,3,7,3],[8,3,9,3],[3,14,3,17],[3,2,4,2],[2,1,2,2],[3,3,4,3],[3,4,4,4],[2,3,2,4],[3,5,4,5],[3,6,3,13],[10,3,11,3],[12,3,13,3],[14,3,15,3],[18,3,19,3],[20,3,21,3],[16,4,17,4],[18,4,19,4],[20,4,21,4],[22,4,23,4],[26,4,27,4],[6,4,7,4],[8,4,9,4],[10,4,11,4],[12,4,13,4],[14,4,15,4],[24,3,25,3],[24,4,25,4],[22,3,23,3],[26,3,27,3],[28,3,29,3]]}
[null,"↖ atgal į turinį",null,"↖ back to content"]
[{"$f":"Kalba","v":"LT"}]
[null,"2 lentelė.    Makroekonominiai ir ciklo rodikliai",null,"Table 2. Macroeconomic and cyclical indicators"]
[null,"Rodiklis ","Žymėjimas | Formulė                    ","Indicator","Notation | Formula",{"$f":"IF(A2=\"LT\",\"Duomenys atnaujinti\",\"Data updated on\")","v":"Duomenys atnaujinti"},{"$f":"IF(A2=\"LT\",\"Faktas\",\"Actuals\")","v":"Faktas"}]
[null,null,null,null,null,null,2012,{"$f":"G5+1","v":2013},2014,2015,2016,2017,{"$f":"L5+1","v":2018},{"$f":"M5+1","v":2019},2011,2010,2009,2008]
[null,"Laikas","T","Time","T",null,"t−7","t−6","t−5","t−4","t−3","t−2","t−1","t","t-8","t-9","t-10","t-11"]
[null,"Nominalus BVP, mln. EUR","YN(T)","Nominal GDP, million EUR","YN(T)","2020-04-17",33331.599999999999,34985,36544.800000000003,37321.800000000003,38893.300000000003,42269.3,45264.4,48339.199999999997]
[null,null,null,null,null,"2020-04-17",33331.599999999999,34985,36544.800000000003,37321.800000000003,38893.300000000003,42269.3,45264.4,48339.199999999997]
[null,"Nominalus BVP, metinis augimas proc.","ΔYN(T)=(YN(T)/YN(T–1)–1)∙100","Nominal GDP growth, annual % change","ΔYN(T)=(YN(T)/YN(T–1)–1)∙100",{"$f":"$F$7","v":"2020-04-17"},null,{"$f":"(H7/G7-1)*100","v":4.9604579438130791},4.4584822066600083,2.1261574834176233,4.2106757980590492,8.6801582791894649,{"$f":"(M7/L7-1)*100","v":7.0857572753747933},{"$f":"(N7/M7-1)*100","v":6.7929763787877295}]
[null,null,null,null,null,{"$f":"$F$8","v":"2020-04-17"},null,4.9604579438130791,4.4584822066600083,2.1261574834176233,4.2106757980590492,8.6801582791894649,{"$f":"(M8/L8-1)*100","v":7.0857572753747933},{"$f":"(N8/M8-1)*100","v":6.7929763787877295}]
[null,"Realus BVP, mln. EUR","YR(T)","Real GDP, million EUR","YR(T)",{"$f":"$F$7","v":"2020-04-17"},34124.200000000004,35338.5,36578.1,37321.9,38275.800000000003,39901.599999999999,41355.800000000003,42974.399999999994]
[null,null,null,null,null,{"$f":"$F$8","v":"2020-04-17"},34124.200000000004,35338.5,36578.1,37321.9,38275.800000000003,39901.599999999999,41355.800000000003,42974.399999999994]
[null,"Realus BVP, metinis augimas proc.","ΔYR(T)=(YR(T)/YR(T–1)–1)∙100","Real GDP growth, annual % change","ΔYR(T)=(YR(T)/YR(T–1)–1)∙100",{"$f":"$F$7","v":"2020-04-17"},null,{"$f":"(H11/G11-1)*100","v":3.5584717004354616},3.507788955388591,2.0334571779288879,2.5558720215208774,4.2475924735733583,{"$f":"(M11/L11-1)*100","v":3.644465384846729},{"$f":"(N11-M11)/M11*100","v":3.9138403803093915}]
[null,null,null,null,null,{"$f":"$F$8","v":"2020-04-17"},null,3.5584717004354616,3.507788955388591,2.0334571779288879,2.5558720215208774,4.2475924735733583,{"$f":"(M12/L12-1)*100","v":3.644465384846729},{"$f":"(N12-M12)/M12*100","v":3.9138403803093915}]
[null,"Potencialus BVP, mln. EUR","Y*(T)","Potential GDP, million EUR","Y*(T)","2020-03-27",35153.768937929781,35815.348938176496,36557.832431456838,37377.238455349579,38256.464968662207,39230.779520456395,40333.034137810799,41522.534635608637,34485.88704328466,33779.766888901882,33222.586104905226,32378.253892683068]
[null,null,null,null,null,"2020-03-20",34983.778544406916,35651.160072966748,36388.690119346917,37136.711582859243,37824.941292684336,38684.941916773467,39823.673063695467,41332.671160059428,34528.546564422562,34184.245940581764,34168.819527174914,33874.677840773649]
[null,"Potencialus BVP, metinis augimas proc.","ΔY*(T)=(Y*(T)/Y*(T–1)–1)∙100","Potential GDP growth, annual % change","ΔY*(T)=(Y*(T)/Y*(T–1)–1)∙100",{"$f":"F15","v":"2020-03-27"},{"$f":"(G15/O15-1)*100","v":1.9366817904577394},{"$f":"(H15/G15-1)*100","v":1.8819603707780352},{"$f":"(I15/H15-1)*100","v":2.0730874200388216},2.2413966293791221,2.3523046368525646,2.5467971298244629,2.8096678955350507,{"$f":"(N15/M15-1)*100","v":2.9491966652782198}]
[null,null,null,null,null,{"$f":"$F$16","v":"2020-03-20"},{"$f":"(G16/O16-1)*100","v":1.318422074717196},{"$f":"(H16/G16-1)*100","v":1.9076885240188801},{"$f":"(I16/H16-1)*100","v":2.068740666140112},2.0556427314612824,{"$f":"(K16/J16-1)*100","v":1.8532327728843612},{"$f":"(L16/K16-1)*100","v":2.2736337313376431},{"$f":"(M16/L16-1)*100","v":2.9436030933479573},{"$f":"(N16/M16-1)*100","v":3.7891986857927717}]
[null,"Atotrūkis nuo potencialo, proc. pot. BVP","AP(T)=(YR(T)/Y*(T)–1)∙100","Output gap (OG), % pot. GDP","OG(T)=(YR(T)/Y*(T–1)–1)∙100",{"$f":"F15","v":"2020-03-27"},{"$f":"(G$11/G15-1)*100","v":-2.928758335266024},{"$f":"(H11/H15-1)*100","v":-1.331409444033671},5.5439743538299169E-2,-0.14805388957690457,5.0540559232636895E-2,1.709934107207367,{"$f":"(M11/M15-1)*100","v":2.5358019401530596},3.496572107489504]
[null,null,null,null,null,{"$f":"$F$16","v":"2020-03-20"},{"$f":"(G$12/G16-1)*100","v":-2.4570774803979512},{"$f":"(H$12/H16-1)*100","v":-0.87699831457610511},0.52051854582251256,0.49866670808362823,1.191961419918619,3.1450430657076867,3.8472768040607175,{"$f":"(N$12/N16-1)*100","v":3.9719882452867061}]
[null,"Ciklinė VS biudžeto dedamoji, proc. pot. BVP","CB(T) = ε∙AP(T)","Cyclical GG budgetary component, % pot. GDP","CB(T) = ε∙OG(T)",{"$f":"$F$15","v":"2020-03-27"},{"$f":"G19*G38","v":-1.1685745757711437},{"$f":"H19*H38","v":-0.53123236816943475},2.212045767178137E-2,-5.9073501941184929E-2,2.0165683133822124E-2,0.6822637087757395,{"$f":"M19*M38","v":1.0117849741210709},{"$f":"N19*N38","v":1.3951322708883123}]
[null,null,null,null,null,{"$f":"$F$16","v":"2020-03-20"},{"$f":"G20*G38","v":-0.98037391467878254},{"$f":"H20*H38","v":-0.34992232751586594},0.20768689978318253,0.19896801652536766,0.475592606547529,1.254872183217367,{"$f":"M20*M38","v":1.5350634448202263},{"$f":"N20*N38","v":1.5848233098693958}]
[null,"Ciklinė VSDF biudžeto dedamoji, proc. pot. BVP","CBVSDF(T) = εVSDF∙AP(T)","Cyclical SSIF budgetary component, % pot. GDP","CBSSIF(T) = εSSIF∙OG(T)",{"$f":"$F$15","v":"2020-03-27"},{"$f":"G19*G39","v":-0.30605524603529949},{"$f":"H19*H39","v":-0.1391322869015186},{"$f":"I19*I39","v":5.793453199752263E-3},-1.5471631460786527E-2,5.2814884398105551E-3,0.17868811420316985,0.26499130274599469,0.35315378285643995]
[null,null,null,null,null,{"$f":"$F$16","v":"2020-03-20"},{"$f":"G20*G39","v":-0.25676459670158591},{"$f":"H20*H39","v":-9.1646323873202984E-2},{"$f":"I20*I39","v":5.4394188038452557E-2},5.211067099473915E-2,{"$f":"K20*K39","v":0.12455996838149569},0.32865700036645323,0.40204042602434498,0.40117081277395733]
[null,"Ciklinė PSDF biudžeto dedamoji, proc. pot. BVP","CBPSDF(T) = εPSDF∙AP(T)","Cyclical NHIF budgetary component, % pot. GDP","CBNHIF(T) = εNHIF∙OG(T)",{"$f":"$F$15","v":"2020-03-27"},null,null,null,null,null,null,{"$f":"M19*M40","v":0.11411108730688768},{"$f":"N19*N40","v":0.15734574483702768}]
[null,null,null,null,null,{"$f":"$F$16","v":"2020-03-20"},null,null,null,null,null,null,{"$f":"M20*M40","v":0.17312745618273229},{"$f":"N20*N40","v":0.17873947103790178}]
[null,"BVP defliatorius, 2010 = 100","PY(T) = YN(T)/YR(T)","GDP deflator, 2010 = 100","PY(T) = YN(T)/YR(T)",{"$f":"$F$7","v":"2020-04-17"},{"$f":"G7/G11*100","v":97.677308185979442},98.999674575887482,99.908961919837296,99.999732060800767,101.6132909044357,105.93384726427011,{"$f":"M7/M11*100","v":109.45115316352241},112.48371123273391]
[null,null,null,null,null,{"$f":"$F$8","v":"2020-04-17"},{"$f":"G8/G12*100","v":97.677308185979442},{"$f":"H8/H12*100","v":98.999674575887482},99.908961919837296,99.999732060800767,101.6132909044357,105.93384726427011,109.45115316352241,112.48371123273391]
[null,"BVP defliatorius, metinis augimas proc.","ΔPY(T)=(PY(T)/PY(T–1)–1)∙100","GDP deflator, annual % change","ΔPY(T)=(PY(T)/PY(T)–1)∙100",{"$f":"$F$7","v":"2020-04-17"},null,{"$f":"(H27/G27-1)*100","v":1.3538112530601554},{"$f":"(I27/H27-1)*100","v":0.91847508372646658},{"$f":"(J27/I27-1)*100","v":9.0852851655398581E-2},1.6135631670031625,4.2519598778645751,{"$f":"(M27/L27-1)*100","v":3.3202852441276631},2.7706954029810937]
[null,null,null,null,null,{"$f":"$F$8","v":"2020-04-17"},null,{"$f":"(H28/G28-1)*100","v":1.3538112530601554},{"$f":"(I28/H28-1)*100","v":0.91847508372646658},9.0852851655398581E-2,1.6135631670031625,4.2519598778645751,3.3202852441276631,{"$f":"(N28/M28-1)*100","v":2.7706954029810937}]
[null,"Vidutinė metinė SVKI infliacija","ΔSVKI(T)","Average annual HICP inflation","ΔHICP(T)",{"$f":"$F$8","v":"2020-04-17"},3.2,1.2,0.2,-0.7,0.7,3.7,2.5,2.2000000000000002]
[null,"ES nominalus BVP, mlrd. EUR","YNES(T)","EU nominal GDP, billion EUR","YNEU(T)","2020-04-17",11390.022199999999,11516.6644,11781.665000000001,12213.010900000001,12550.4596,13046.7757,13484.821800000002,13918.144400000001]
[null,"ES nominalus BVP, metinis augimas proc.","ΔYNES(T)=(YNES(T)/YNES(T–1)–1)∙100","EU nominal GDP growth, annual % change","ΔYNEU(T)=(YNEU(T)/YNEU(T–1)–1)∙100",{"$f":"$F$32","v":"2020-04-17"},null,{"$f":"(H32/G32-1)*100","v":1.1118696502628422},{"$f":"(I32/H32-1)*100","v":2.3010186873206218},{"$f":"(J32/I32-1)*100","v":3.6611624927376685},2.7630262738895794,3.9545651379970126,{"$f":"(M32/L32-1)*100","v":3.357504643848519},{"$f":"(N32/M32-1)*100","v":3.2134099095028512}]
[null,"VS biudžeto balansas mln. EUR","BL(T)","Balance of GG budget, million EUR","BL(T)","2020-04-17",-1049.2349999999999,-913.02700000000004,-226.19300000000001,-100.74,90.33,192.04,271.8,129.30000000000001]
[null,null,null,null,null,"2020-04-17",-1049.2349999999999,-913.02700000000004,-226.19300000000001,-100.74,90.33,192.04,271.8,129.30000000000001]
[null,"VS biudžeto balansas proc. BVP","B(T)=BL(T)/YN(T)","Balance of GG budget, % of GDP","B(T)=BL(T)/YN(T)",{"$f":"+F34","v":"2020-04-17"},{"$f":"G34/G7*100","v":-3.1478686891718364},-2.6097670430184365,-0.61894715527243271,-0.26992267253990959,0.23225079898080131,0.45432500656504837,{"$f":"M34/M7*100","v":0.60047189402709422},0.26748477426188272]
[null,null,null,null,null,{"$f":"F8","v":"2020-04-17"},{"$f":"G35/G8*100","v":-3.1478686891718364},-2.6097670430184365,-0.61894715527243271,-0.26992267253990959,0.23225079898080131,{"$f":"L35/L8*100","v":0.45432500656504837},0.60047189402709422,{"$f":"N35/N8*100","v":0.26748477426188272}]
[null,"VS biudžeto dalinis elastingumas pot. BVP","ε","Semi-elasticity of the GG budget to the OG","ε","2020-03-20",0.39900000000000002,{"$f":"G38","v":0.39900000000000002},{"$f":"G38","v":0.39900000000000002},{"$f":"G38","v":0.39900000000000002},{"$f":"G38","v":0.39900000000000002},{"$f":"G38","v":0.39900000000000002},{"$f":"G38","v":0.39900000000000002},{"$f":"G38","v":0.39900000000000002}]
[null,"VSDF biudžeto semi-elastingumas pot. BVP","εVSDF","Semi-elasticity of the SSIF budget to the OG","εSSIF",{"$f":"F26","v":"2020-03-20"},{"$f":"H39","v":0.1045},{"$f":"I39","v":0.1045},0.1045,{"$f":"K39","v":0.1045},0.1045,{"$f":"M39","v":0.1045},0.1045,0.10100000000000001]
[null,"PSDF biudžeto semi-elastingumas pot. BVP","εPSDF","Semi-elasticity of the NHIF budget to the OG","εNHIF",{"$f":"F26","v":"2020-03-20"},null,null,null,null,null,null,4.4999999999999998E-2,4.4999999999999998E-2]
[]
[null,null,"Šaltiniai:",null,"Sources:"]
[null,null,"Europos Komisija, Eurostatas, Lietuvos statistikos departamentas",null,"European Commission, Eurostat, Statistics Lithuania"]
[null,"2019 pavasario ERS duomenys","Finansų ministerija (FM)","2019 spring EDS data","Ministry of Finance (MoF)"]
[null,null,"Fiskalinės institucijos skaičiavimai",null,"Independent fiscal institution calculations"]
[null,null,"ERS – ekonominės raidos scenarijus",null,"EDS – economic development scenario"]
[null,null,"Dėmesio: langeliai su formulėmis, atnaujinami tik spalvoti langeliai",null,"Warning: cells with formulas, data inputs are marked with coloured cells"]
[null,null,"Apvalinimo tikslumas",null,"Rounding threshold",4.9999999999999899E-2]

{"sheet":"3. GGbudget","index":4,"n_rows":29,"n_cols":13,"rows_kept":29,"cut":false,"hidden":false,"merged":[[0,3,0,4],[3,4,4,4],[2,3,2,4],[3,2,4,2],[2,1,2,2],[3,1,4,1],[3,3,4,3],[40,2,40,5],[41,2,41,5],[33,2,33,5],[32,2,32,7],[34,2,34,5],[35,2,35,5],[36,2,36,5],[37,2,37,5],[38,2,38,5]]}
[null,"↖ atgal į turinį",null,"↖ back to content"]
[{"$f":"Kalba","v":"LT"}]
[null,"3 lentelė.    VS fiskaliniai rodikliai",null,"Table 3. GG fiscal indicators"]
[null,"Rodiklis","Žymėjimas | Formulė    ","Indicator","   Notation | Formula",{"$f":"IF($A$2=\"LT\",\"proc. BVP\",\"% of GDP\")","v":"proc. BVP"},{"$f":"IF($A$2=\"LT\",\"mln. EUR\", \"mil. EUR\")","v":"mln. EUR"},{"$f":"IF($A$2=\"LT\",\"proc. BVP\",\"% of GDP\")","v":"proc. BVP"},{"$f":"IF($A$2=\"LT\",\"mln. EUR\", \"mil. EUR\")","v":"mln. EUR"},{"$f":"IF($A$2=\"LT\",\"proc. BVP\",\"% of GDP\")","v":"proc. BVP"},{"$f":"IF($A$2=\"LT\",\"mln. EUR\", \"mil. EUR\")","v":"mln. EUR"},{"$f":"IF($A$2=\"LT\",\"proc. BVP\",\"% of GDP\")","v":"proc. BVP"},{"$f":"IF($A$2=\"LT\",\"mln. EUR\", \"mil. EUR\")","v":"mln. EUR"}]
[null,null,null,null,null,{"$f":"'2. Macro'!M5","v":2018},{"$f":"F5","v":2018},{"$f":"'2. Macro'!N5","v":2019},{"$f":"H5","v":2019},{"$f":"G5","v":2018},{"$f":"J5","v":2018},{"$f":"I5","v":2019},{"$f":"L5","v":2019}]
[null,"Nominalus BVP",null,"Nominal GDP, million EUR",null,null,{"$f":"'2. Macro'!M8","v":45264.4},null,{"$f":"'2. Macro'!N8","v":48339.199999999997},null,{"$f":"'2. Macro'!M7","v":45264.4},null,{"$f":"'2. Macro'!N7","v":48339.199999999997}]
[null,"Grynasis skolinimas (+) / grynasis skolinimasis (-), iš jo","B=VP–VI","Net lending (+) /net borrowing (-), of which","B=TR–TE",{"$f":"G7/G6*100","v":0.60047189402709256},{"$f":"G10-G11","v":271.79999999999927},{"$f":"H10-H11","v":0.26748477426188799},{"$f":"I10-I11","v":129.30000000000291},{"$f":"K7/K6*100","v":0.60047189402709256},{"$f":"K10-K11","v":271.79999999999927},0.26748477426188799,129.30000000000291]
[null,"Valstybinis socialinio draudimo fondas","VSDF","State Social Insurance Fund","SSIF",{"$f":"G8/G6*100","v":8.5007202127941603},3847.8,{"$f":"I8/I6*100","v":0.57386137958427108},277.39999999999998,{"$f":"F8","v":8.5007202127941603},{"$f":"G8","v":3847.8},{"$f":"H8","v":0.57386137958427108},{"$f":"I8","v":277.39999999999998}]
[null,"Privalomojo sveikatos draudimo fondas","PSDF","National Health Insurance Fund","NHIF",{"$f":"G9/G6*100","v":0.19007303392953076},86.035418369998524,{"$f":"I9/I6*100","v":6.3803691250277711E-2},30.842193920854243,{"$f":"F9","v":0.19007303392953076},{"$f":"G9","v":86.035418369998524},{"$f":"M9/M6*100","v":6.3803691250277711E-2},{"$f":"I9","v":30.842193920854243}]
[null,"Visos pajamos","VP","Total revenues","TR",{"$f":"G10/G6*100","v":34.647765131096399},15683.102999999999,{"$f":"I10/I6*100","v":35.217183983185492},17023.705000000002,{"$f":"K10/K6*100","v":34.647765131096399},{"$f":"G10","v":15683.102999999999},{"$f":"M10/M6*100","v":35.217183983185492},{"$f":"I10","v":17023.705000000002}]
[null,"Visos išlaidos, iš jų","VI","Total expenditures, of which","TE",{"$f":"G11/G6*100","v":34.047293237069312},15411.303,{"$f":"I11/I6*100","v":34.949699208923604},16894.404999999999,{"$f":"K11/K6*100","v":34.047293237069312},{"$f":"G11","v":15411.303},{"$f":"M11/M6*100","v":34.949699208923604},{"$f":"I11","v":16894.404999999999}]
[null,"Centrinė valdžia, be pervedimų SAF","CV","Central government, net of transfers to SSF","CG",{"$f":"G12/G6*100","v":17.969836157797296},8133.9385178100001,{"$f":"I12/I6*100","v":18.399430896663578},8894.1376999999993,{"$f":"K12/K6*100","v":17.969836157797296},{"$f":"G12","v":8133.9385178100001},{"$f":"M12/M6*100","v":18.399430896663578},{"$f":"I12","v":8894.1376999999993}]
[null,"Socialinės apsaugos fondai, be pervedimų CV","SAF","Social Security Funds, net of transfers to CG","SSF",{"$f":"G13/G6*100","v":12.88267755675542},5831.2667000000001,{"$f":"I13/I6*100","v":12.7277662849199},6152.5003999999999,{"$f":"K13/K6*100","v":12.88267755675542},{"$f":"G13","v":5831.2667000000001},{"$f":"M13/M6*100","v":12.7277662849199},{"$f":"I13","v":6152.5003999999999}]
[null,"Konsoliduotos išlaidos VS posektorių, kurių išlaidos > 3 proc. BVP","AV3=CV+SAF","Consolidated expenditure of GG subsectors with exp.    >  3 % of GDP","AG3=CG+SSF",{"$f":"F13+F12","v":30.852513714552714},{"$f":"G13+G12","v":13965.20521781},{"$f":"I14/I6*100","v":31.127197181583476},{"$f":"I12+I13","v":15046.6381},{"$f":"K14/K6*100","v":30.852513714552714},{"$f":"K12+K13","v":13965.20521781},{"$f":"M14/M6*100","v":31.127197181583476},{"$f":"M12+M13","v":15046.6381}]
[null,"Vienkartinės ir kitos laikinosios priemonės","1klp","One-off and temporary measures","1off",{"$f":"G15/G6*100","v":-1.5464691899152533E-2},-7,{"$f":"I15/I6*100","v":7.7163047795577921E-2},37.299999999999997,{"$f":"K15/K6*100","v":-1.5464691899152533E-2},{"$f":"G15","v":-7},{"$f":"M15/M6*100","v":7.7163047795577921E-2},{"$f":"I15","v":37.299999999999997}]
[null,"Vienkartinės ir kitos laikinosios priemonės, VSDF","1klpVSDF","One-off and temporary measures, SSIF","1offSSIF",{"$f":"G16/G6*100","v":0},0,{"$f":"I16/$I$6*100","v":0},0,{"$f":"F16","v":0},{"$f":"G16","v":0},{"$f":"M16/$M$6*100","v":0},{"$f":"I16","v":0}]
[null,"Vienkartinės ir kitos laikinosios priemonės, PSDF","1klpPSDF","One-off and temporary measures, NHIF","1offNHIF",{"$f":"G17/G7*100","v":0},0,{"$f":"I17/$I$6*100","v":0},0,{"$f":"F17","v":0},{"$f":"G17","v":0},{"$f":"M17/$M$6*100","v":0},{"$f":"I17","v":0}]
[null,"Lankstumo galimybė dėl vykdomų struktūrinių reformų","SR","Structural reform flexibility clause","SR",0.5,null,0.5,null,0.5,null,0.5]
[null,"Struktūrinis VS balansas, neįtraukiant struktūrinių reformų","SB = B–CB–1klp+SR","Structural GG balance, excluding structural reforms","SB = B–CB–1off+SR",{"$f":"F7-F15-'2. Macro'!M22+F18","v":-0.41912685889398116},null,{"$f":"H7-H15-'2. Macro'!N22+H18","v":-0.89450158340308583},null,{"$f":"J7-J15-'2. Macro'!M21+J18","v":0.10415161180517418},null,{"$f":"L7-L15-'2. Macro'!N21+L18","v":-0.70481054442200231}]
[null,"Struktūrinis VSDF balansas","SBVSDF = VSDF– CBVSDF–1klpVSDF","Structural SSIF balance","SBSSIF = SSIF– CBSSIF–1offSSIF",{"$f":"F8-F16-'2. Macro'!M24","v":8.0986797867698161},null,{"$f":"H8-H16-'2. Macro'!N24","v":0.17269056681031375},null,{"$f":"J8-J16-'2. Macro'!M23","v":8.2357289100481665},null,{"$f":"L8-L16-'2. Macro'!N23","v":0.22070759672783113}]
[null,"Struktūrinis PSDF balansas","SBPSDF = PSDF– CBPSDF–1klpPSDF","Structural NHIF balance","SBNHIF = NHIF– CBNHIF–1offNHIF",{"$f":"F9-F17-'2. Macro'!M26","v":1.6945577746798474E-2},null,{"$f":"H9-H17-'2. Macro'!N26","v":-0.11493577978762406},null,{"$f":"J9-J17-'2. Macro'!M25","v":7.5961946622643078E-2},null,{"$f":"L9-L17-'2. Macro'!N25","v":-9.3542053586749968E-2}]
[null,"Vidutinio laikotarpio tikslas","VLT","Medium-term objective","MTO",-1,null,-1,null,{"$f":"F22","v":-1},null,{"$f":"H22","v":-1}]
[null,"Struktūrinio postūmio užduotis","SPU","Structural adjustment target","SAT",0,null,0,null,{"$f":"F23","v":0},null,{"$f":"H23","v":0}]
[]
[null,null,"Šaltiniai:",null,"Sources:"]
[null,null,"Finansų ministerija, VSDF, PSDF",null,"Ministry of Finance, SSIF, NHIF"]
[null,null,"Fiskalinės institucijos skaičiavimai",null,"Independent fiscal institution calculations"]
[]
[null,null,"Dėmesio: langeliai su formulėmis, atnaujinami tik spalvoti langeliai",null,"Warning: cells with formulas, data inputs are marked with coloured cells"]

{"sheet":"5. SurplusGG","index":5,"n_rows":31,"n_cols":11,"rows_kept":31,"cut":false,"hidden":false,"merged":[[0,6,0,7],[15,2,15,5],[15,7,15,10],[17,9,17,10],[4,7,4,8],[4,2,4,3],[5,8,6,8],[3,6,4,6],[0,1,0,2],[5,2,6,2],[5,1,6,1],[7,1,8,1],[9,1,10,1],[11,1,12,1],[2,1,2,5],[3,1,4,1],[20,9,20,10],[22,9,22,10],[25,9,25,10],[24,9,24,10],[7,3,8,3],[7,8,8,8],[13,3,14,3],[13,8,14,8],[11,3,12,3],[11,8,12,8],[9,6,10,6],[11,6,12,6],[9,8,10,8],[13,6,14,6],[7,6,8,6],[25,4,25,5],[24,4,24,5],[3,4,3,5],[20,4,20,5],[17,4,17,5],[5,6,6,6],[22,4,22,5],[13,1,14,1],[13,2,14,2],[2,6,2,10],[7,2,8,2],[9,2,10,2],[11,2,12,2],[9,3,10,3],[3,9,3,10],[5,3,6,3],[5,7,6,7],[13,7,14,7],[11,7,12,7],[9,7,10,7],[7,7,8,7]]}
[null,"↖ atgal į turinį ",null,null,null,null,"↖ back to content"]
[{"$f":"Kalba","v":"LT"}]
[null,"5 lentelė. Perteklinio VS taisyklės sąlygos",null,null,null,null,"Table 5. Conditions of the surplus GG sector rule"]
[null,"Nr.","Sąlyga","Formulė","Išvada",null,"No.","Condition","Formula","Conclusion"]
[null,null,"Institucija, kurios projekcijų pagrindu atliekama analizė",null,"FM","IFI",null,"Institution, projections of which are used for the analysis",null,"MoF","IFI"]
[null,"S1","VS yra faktiškai perteklinis t metais pagal struktūrinį balansą","SB(t) > 0*",{"$f":"IF(J6,\"Tiesa\",\"Netiesa\")","v":"Netiesa"},{"$f":"IF(K6,\"Tiesa\",\"Netiesa\")","v":"Netiesa"},"C1","In terms of structural balance GG sector is actually in surplus   ","SB(t) > 0*",{"$f":"IF(J19>eps,TRUE,FALSE)","v":false},{"$f":"IF(K19>eps,TRUE,FALSE)","v":false}]
[null,null,null,null,{"$f":"CONCATENATE(TEXT(ROUND(J19,1),\"0,0; –0,0\"),IF(J6,\" ≥ \",\" < \"),\"0,0\")","v":" –0,9 < 0,0"},{"$f":"CONCATENATE(TEXT(K19,\"0,0; –0,0\"),IF(K6,\" ≥ \",\" < \"),\"0,0\")","v":" –0,7 < 0,0"},null,null,null,{"$f":"CONCATENATE(TEXT(ROUND(J19,1),\"0.0; –0.0\"),IF(J6,\" ≥ \",\" < \"),\"0.1\")","v":" –0.1 < 0.1"},{"$f":"CONCATENATE(TEXT(ROUND(K19,1),\"0.0; –0.0\"),IF(K6,\" ≥ \",\" < \"),\"0.1\")","v":" –0.1 < 0.1"}]
[null,"S2","Faktinio struktūrinio VS balanso rodiklio absoliučioji vertė yra mažesnė negu VLT absoliučioji vertė ir kiekvienais metais mažėja, išskyrus metus, kai produkcijos atotrūkio nuo potencialo rodiklis yra neigiamas","|SB(t)| < |VLT| ir \n|SB(t)| < |SB(t–1)| ir\nAP(t) ≥ 0",{"$f":"IF(J8,\"Tiesa\",\"Netiesa\")","v":"Netiesa"},{"$f":"IF(K8,\"Tiesa\",\"Netiesa\")","v":"Netiesa"},"C2","Actual structural GG sector balance indicator in absolute value is lower than MTO in absolute value and is annually decreasing, with the exception of the  year when the output gap is negative","|SB(t)| < |MTO| and\n|SB(t)| < |SB(t–1)| and\nOG(t) ≥ 0",{"$f":"IF((J22>=-eps)*(ABS(J19)+eps<ABS($J$21))*(ABS(J19)<ABS(J20)),TRUE,FALSE)","v":false},{"$f":"IF((K22>=-eps)*(ABS(K19)+eps<ABS($J$21))*(ABS(K19)+0.1<ABS(K20)),TRUE,FALSE)","v":false}]
[null,null,null,null,{"$f":"CONCATENATE(TEXT(ROUND(ABS(E19),1),\"0,0; –0,0\"),IF(ABS(E19)+eps<ABS($E$21),\" < \",\" ≥ \"),TEXT(ROUND(ABS(E21),1),\"0,0; –0,0\"),\" ir \n\",TEXT(ROUND(ABS(E19),2),\"0,0; –0,0\"),IF(ABS(E19)<ABS(E20),\" < \",\" ≥ \"),TEXT(ROUND(ABS(E20),2),\"0,0; –0,0\"),\" ir\n \",TEXT(ROUND(E22,1),\"0,0; –0,0\"),IF(E22<-eps,\" < \",\" ≥ \"),\"0,0\")","v":"0,9 < 1,0 ir \n0,9 ≥ 0,4 ir\n 4,0 ≥ 0,0"},{"$f":"CONCATENATE(TEXT(ROUND(ABS(F19),2),\"0,0; –0,0\"),IF(ABS(F19)+eps<ABS($E$21),\" < \",\" ≥ \"),TEXT(ROUND(ABS(E21),2),\"0,0; –0,0\"),\" ir \n\",TEXT(ROUND(ABS(F19),2),\"0,0; –0,0\"),IF(ABS(F19)+0.1<ABS(F20),\" < \",\" ≥ \"),TEXT(ROUND(ABS(F20),2),\"0,0; –0,0\"),\" ir\n \",TEXT(ROUND(F22,2),\"0,0; –0,0\"),IF(F22<-eps,\" < \",\" ≥ \"),\"0,0\")","v":"0,7 < 1,0 ir \n0,7 ≥ 0,1 ir\n 3,5 ≥ 0,0"},null,null,null,{"$f":"CONCATENATE(TEXT(ROUND(ABS(J19),1),\"0.0; –0.0\"),IF(ABS(J19)+eps<ABS($J$21),\" < \",\" ≥ \"),TEXT(ROUND(ABS($J$21),1),\"0.0; –0.0\"),\" and\n\",TEXT(ROUND(ABS(J19),1),\"0.0; –0.0\"),IF(ABS(J19)<ABS(J20),\" < \",\" ≥ \"),TEXT(ROUND(ABS(J20),1),\"0.0; –0.0\"),\" and\n\",TEXT(ROUND(J22,1),\"0.0; –0.0\"),IF(J22<-eps,\" < \",\" ≥ \"),\"0.0\")","v":"0.1 < 0.1 and\n0.1 ≥ 0.0 and\n0.4 ≥ 0.0"},{"$f":"CONCATENATE(TEXT(ROUND(ABS(K19),2),\"0.0; –0.0\"),IF(ABS(K19)+eps<ABS($J$21),\" < \",\" ≥ \"),TEXT(ROUND(ABS($J$21),2),\"0.0; –0.0\"),\" and\n\",TEXT(ROUND(ABS(K19),2),\"0.0; –0.0\"),IF(ABS(K19)+0.1<ABS(K20),\" < \",\" ≥ \"),TEXT(ROUND(ABS(K20),2),\"0.0; –0.0\"),\" and\n\",TEXT(ROUND(K22,2),\"0.0; –0.0\"),IF(K22<-eps,\" < \",\" ≥ \"),\"0.0\")","v":"0.1 < 0.1 and\n0.1 ≥ 0.0 and\n0.4 ≥ 0.0"}]
[null,"S3","Faktinio struktūrinio VS balanso rodiklio absoliučioji vertė yra mažesnė negu VLT absoliučioji vertė tais metais, kai produkcijos atotrūkio nuo potencialo rodiklis yra neigiamas","|SB(t)| < |VLT| ir\nAP(t) < 0",{"$f":"IF(J10,\"Tiesa\",\"Netiesa\")","v":"Netiesa"},{"$f":"IF(K10,\"Tiesa\",\"Netiesa\")","v":"Netiesa"},"C3","Actual structural GG sector balance indicator in absolute value is lower than the MTO in absolute value in the year when the output gap is negative","|SB(t)| < |MTO| and\nOG(t) < 0",{"$f":"IF((J22<-eps)*(ABS(J19)+eps<ABS($J$21)),TRUE,FALSE)","v":false},{"$f":"IF((K22<-eps)*(ABS(K19)+eps<ABS($J$21)),TRUE,FALSE)","v":false}]
[null,null,null,null,{"$f":"CONCATENATE(TEXT(ROUND(ABS(E19),1),\"0,0; –0,0\"),IF(ABS(E19)+eps<ABS($E$21),\" < \",\" ≥ \"),TEXT(ROUND(ABS($E$21),1),\"0,0; –0,0\"),\" ir\n\",TEXT(ROUND(E22,1),\"0,0; –0,0\"),IF(E22<-eps,\" < \",\" ≥ \"),\"0,0\")","v":"0,9 < 1,0 ir\n4,0 ≥ 0,0"},{"$f":"CONCATENATE(TEXT(ROUND(ABS(F19),1),\"0,0; –0,0\"),IF(ABS(F19)+eps<ABS($E$21),\" < \",\" ≥ \"),TEXT(ROUND(ABS($E$21),1),\"0,0; –0,0\"),\" ir\n\",TEXT(ROUND(F22,1),\"0,0; –0,0\"),IF(F22<-eps,\" < \",\" ≥ \"),\"0,0\")","v":"0,7 < 1,0 ir\n3,5 ≥ 0,0"},null,null,null,{"$f":"CONCATENATE(TEXT(ROUND(ABS(J19),1),\"0.0; –0.0\"),IF(ABS(J19)+eps<ABS($J$21),\" < \",\" ≥ \"),TEXT(ROUND(ABS($J$21),1),\"0.0; –0.0\"),\" and\n\",TEXT(ROUND(J22,1),\"0.0; –0.0\"),IF(J22<-eps,\" < \",\" ≥ \"),\"0.0\")","v":"0.1 < 0.1 and\n0.4 ≥ 0.0"},{"$f":"CONCATENATE(TEXT(ROUND(ABS(K19),1),\"0.0; –0.0\"),IF(ABS(K19)+eps<ABS($J$21),\" < \",\" ≥ \"),TEXT(ROUND(ABS($J$21),1),\"0.0; –0.0\"),\" and\n\",TEXT(ROUND(K22,1),\"0.0; –0.0\"),IF(K22<-eps,\" < \",\" ≥ \"),\"0.0\")","v":"0.1 < 0.1 and\n0.4 ≥ 0.0"}]
[null,"S4","Faktinio struktūrinio VS balanso rodiklio postūmio VLT link absoliučioji vertė yra ne mažesnė negu struktūrinio postūmio užduoties absoliučioji vertė","SPU(t) > 0 ir\nSB(t) ≥ SB(t–1)+SPU(t)",{"$f":"IF(J12,\"Tiesa\",\"Netiesa\")","v":"Netiesa"},{"$f":"IF(K12,\"Tiesa\",\"Netiesa\")","v":"Netiesa"},"C4","Actual structural GG sector balance indicator adjustment towards the MTO in absolute value is not lower than the structural adjustment target in absolute value.","SAT(t) > 0 and\nSB(t) ≥ SB(t–1)+SAT(t)",{"$f":"IF(($J$23>0)*(J19>=J20+$J$23),TRUE,FALSE)","v":false},{"$f":"IF(($J$23>0)*(K19>=K20+$J$23),TRUE,FALSE)","v":false}]
[null,null,null,null,{"$f":"IF($E$23=0,\"Netaikoma\",CONCATENATE(TEXT(ROUND(E19,1),\"0,0; –0,0\"),IF(E19>=E20+$E$23,\" ≥ \",\" < \"),TEXT(ROUND(E20,1),\"0,0; –0,0\"),\" + \",TEXT(ROUND($E$23,1),\"0,0; –0,0\"),\" = \",TEXT(ROUND(J20+$E$23,1),\"0,0; –0,0\")))","v":"Netaikoma"},{"$f":"IF($E$23=0,\"Netaikoma\",CONCATENATE(TEXT(ROUND(F19,1),\"0,0; –0,0\"),IF(F19>=F20+$E$23,\" ≥ \",\" < \"),TEXT(ROUND(F20,1),\"0,0; –0,0\"),\" + \",TEXT(ROUND($E$23,1),\"0,0; –0,0\"),\" = \",TEXT(ROUND(K20+$E$23,1),\"0,0; –0,0\")))","v":"Netaikoma"},null,null,null,{"$f":"IF($J$23=0,\"Not aplicaple\",CONCATENATE(TEXT(ROUND(J19,1),\"0.0; –0.0\"),IF(J19>=J20+$J$23,\" ≥ \",\" < \"),TEXT(ROUND(J20,1),\"0.0; –0.0\"),\" + \",TEXT(ROUND($J$23,1),\"0.0; –0.0\"),\" = \",TEXT(ROUND(J20+$J$23,1),\"0.0; –0.0\")))","v":"Not aplicaple"},{"$f":"IF($J$23=0,\"Not aplicaple\",CONCATENATE(TEXT(ROUND(K19,1),\"0.0; –0.0\"),IF(K19>=K20+$J$23,\" ≥ \",\" < \"),TEXT(ROUND(K20,1),\"0.0; –0.0\"),\" + \",TEXT(ROUND($J$23,1),\"0.0; –0.0\"),\" = \",TEXT(ROUND(K20+$J$23,1),\"0.0; –0.0\")))","v":"Not aplicaple"}]
[null,"S","t metais, išskyrus metus, kuriais susidaro išskirtinės aplinkybės, turi būti tenkinama bent viena iš  S1–S4 sąlygų ",null,{"$f":"IF(OR(J6,J8,J10,J12),\"Taip\",\"Ne\")","v":"Ne"},{"$f":"IF(OR(K6,K8,K10,K12),\"Taip\",\"Ne\")","v":"Ne"},"C","At year t, with the exception of the year of exceptional circumstances, at least one of the C1–C4 conditions is satisfied ",null,{"$f":"IF(E31>0,\"Yes\",\"No\")","v":"No"},{"$f":"IF(F31>0,\"Yes\",\"No\")","v":"No"}]
[null,null,null,null,{"$f":"IF(J14=\"Yes\",IF(E31=1,CONCATENATE(\"Tenkinama \",I27,I28,I29,I30,\" sąlyga\"),CONCATENATE(\"Tenkinamos \", IF(E27=1,CONCATENATE(I27,\" \"),\"\"),IF(E28=1,CONCATENATE(I28,\" \"),\"\"),IF(E29=1,CONCATENATE(I29,\" \"),\"\"),IF(E30=1,CONCATENATE(I30,\" \"),\"\"),\"sąlygos\")),\"Netenkinama nei viena iš sąlygų\")","v":"Netenkinama nei viena iš sąlygų"},{"$f":"IF(K14=\"Yes\",IF(F31=1,CONCATENATE(\"Tenkinama \",H27,H28,H29,H30,\" sąlyga\"),CONCATENATE(\"Tenkinamos \", IF(F27=1,CONCATENATE(H27,\" \"),\"\"),IF(F28=1,CONCATENATE(H28,\" \"),\"\"),IF(F29=1,CONCATENATE(H29,\" \"),\"\"),IF(F30=1,CONCATENATE(H30,\" \"),\"\"),\"sąlygos\")),\"Netenkinama nei viena iš sąlygų\")","v":"Netenkinama nei viena iš sąlygų"},null,null,null,{"$f":"IF(J14=\"Yes\",IF(E31=1,CONCATENATE(\"Condition \",J27,J28,J29,J30,\" is valid\"),CONCATENATE(\"Conditions \", IF(E27=1,CONCATENATE(J27,\" \"),\"\"),IF(E28=1,CONCATENATE(J28,\" \"),\"\"),IF(E29=1,CONCATENATE(J29,\" \"),\"\"),IF(E30=1,CONCATENATE(J30,\" \"),\"\"),\"are valid\")),\"None of the conditions is valid\")","v":"None of the conditions is valid"},{"$f":"IF(K14=\"Yes\",IF(F31=1,CONCATENATE(\"Condition \",K27,K28,K29,K30,\" is valid\"),CONCATENATE(\"Conditions \", IF(F27=1,CONCATENATE(K27,\" \"),\"\"),IF(F28=1,CONCATENATE(K28,\" \"),\"\"),IF(F29=1,CONCATENATE(K29,\" \"),\"\"),IF(F30=1,CONCATENATE(K30,\" \"),\"\"),\"are valid\")),\"None of the conditions is valid\")","v":"None of the conditions is valid"}]
[null,null,"* nelygybės ženklas yra griežtas, jei skirtumas tarp lyginamų pusių po apvalinimo sudaro bent 0,1, \nkitaip ženklas interpretuojamas kaip =",null,null,null,null,"* inequality sign is strict, if a difference between both compared sides\n after rounding is at least 0,1, else the sign is interpreted as ="]
[null,null,"Šaltinis: KĮ 3 straipsnis 1 dalis",null,null,null,null,"Source: CL Article 3(1)"]
[null,null,null,"t =",2019,null,null,null,"t =",{"$f":"E18","v":2019}]
[null,null,null,"SB(t) =",{"$f":"'3. GGbudget'!H19","v":-0.89450158340308583},{"$f":"'3. GGbudget'!L19","v":-0.70481054442200231},null,null,"SB(t) =",{"$f":"E19","v":-0.89450158340308583},{"$f":"F19","v":-0.70481054442200231}]
[null,null,null,"SB(t–1) =",{"$f":"'3. GGbudget'!F19","v":-0.41912685889398116},{"$f":"'3. GGbudget'!J19","v":0.10415161180517418},null,null,"SB(t–1) =",-0.41912685889398116,{"$f":"F20","v":0.10415161180517418}]
[null,null,null,"VLT =",{"$f":"'3. GGbudget'!H22","v":-1},null,null,null,"MTO =",-1]
[null,null,null,"AP(t) =",{"$f":"'2. Macro'!N20","v":3.9719882452867061},{"$f":"'2. Macro'!N19","v":3.496572107489504},null,null,"OG(t) =",3.9719882452867061,{"$f":"F22","v":3.496572107489504}]
[null,null,null,"SPU(t) =",{"$f":"'3. GGbudget'!H23","v":0},null,null,null,"SAT(t) =",0]
[null,null,null,"Šaltiniai:",null,null,null,null,"Sources:"]
[null,null,null,"Finansų ministerija","FM",null,null,null,"Ministry of Finance","MoF"]
[null,null,null,"Fiskalinė institucija","IFI",null,null,null,"Independent Fiscal Institution","IFI"]
[null,null,"S1","C1",{"$f":"J6*1","v":0},{"$f":"(K6)*1","v":0},{"$f":"IF(#REF!=1,$C27,\"\")","v":{"$error":"#REF!"}},{"$f":"IF(F27=1,$C27,\"\")","v":""},{"$f":"IF(E27=1,$C27,\"\")","v":""},{"$f":"IF(E27=1,$D27,\"\")","v":""},""]
[null,null,"S2","C2",{"$f":"J8*1","v":0},{"$f":"(K8)*1","v":0},{"$f":"IF(#REF!=1,$C28,\"\")","v":{"$error":"#REF!"}},{"$f":"IF(F28=1,$C28,\"\")","v":""},{"$f":"IF(E28=1,$C28,\"\")","v":""},"",""]
[null,null,"S3","C3",{"$f":"J10*1","v":0},{"$f":"(K10)*1","v":0},{"$f":"IF(#REF!=1,$C29,\"\")","v":{"$error":"#REF!"}},{"$f":"IF(F29=1,$C29,\"\")","v":""},{"$f":"IF(E29=1,$C29,\"\")","v":""},"",""]
[null,null,"S4","C4",{"$f":"J12*1","v":0},{"$f":"(K12)*1","v":0},{"$f":"IF(#REF!=1,$C30,\"\")","v":{"$error":"#REF!"}},{"$f":"IF(F30=1,$C30,\"\")","v":""},{"$f":"IF(E30=1,$C30,\"\")","v":""},"",""]
[null,null,null,null,{"$f":"SUM(E27:E30)","v":0},{"$f":"SUM(F27:F30)","v":0}]

{"sheet":"6. GGexpenditure","index":6,"n_rows":59,"n_cols":13,"rows_kept":59,"cut":false,"hidden":false,"merged":[[39,13,39,14],[40,13,40,14],[41,13,41,14],[42,13,42,14],[53,5,53,6],[53,11,53,12],[40,5,40,6],[39,5,39,6],[39,11,39,12],[40,11,40,12],[41,11,41,12],[52,5,52,6],[52,11,52,12],[45,5,45,6],[45,11,45,12],[51,5,51,6],[51,11,51,12],[42,5,42,6],[42,11,42,12],[41,5,41,6],[28,2,28,4],[23,3,23,4],[20,3,20,4],[20,5,20,6],[0,7,0,8],[4,8,4,10],[5,2,6,2],[11,2,12,2],[11,7,12,7],[9,8,10,8],[9,2,10,2],[23,9,23,10],[21,8,25,8],[24,3,25,4],[24,9,25,10],[9,9,10,10],[5,7,6,7],[7,2,8,2],[26,3,27,4],[13,9,13,10],[18,9,19,10],[21,3,22,4],[16,9,17,10],[0,1,0,2],[30,5,30,6],[30,11,30,12],[34,5,34,6],[33,11,33,12],[34,11,34,12],[33,5,33,6],[20,11,20,12],[28,8,28,10],[26,8,27,8],[21,7,25,7],[21,9,22,10],[20,9,20,10],[26,9,27,10],[26,7,27,7],[14,3,15,4],[13,3,13,4],[3,1,4,1],[18,2,19,2],[18,8,19,8],[18,1,19,1],[3,3,3,4],[3,5,3,6],[14,7,15,7],[14,8,15,8],[5,1,6,1],[5,3,6,4],[9,1,10,1],[5,8,6,8],[3,7,4,7],[11,3,12,4],[9,3,10,4],[18,7,19,7],[18,3,19,4],[16,7,17,7],[16,8,17,8],[16,3,17,4],[21,1,25,1],[21,2,25,2],[26,1,27,1],[16,1,17,1],[16,2,17,2],[26,2,27,2],[2,7,2,12],[2,1,2,6],[14,9,15,10],[3,11,3,12],[3,9,3,10],[9,7,10,7],[11,8,12,8],[11,9,12,10],[5,9,6,10],[4,2,4,4],[7,8,8,8],[7,9,8,10],[7,7,8,7],[7,1,8,1],[7,3,8,4],[11,1,12,1],[14,1,15,1],[14,2,15,2]]}
[null,"↖ atgal į turinį ",null,null,null,null,null,"↖ back to content"]
[{"$f":"Kalba","v":"LT"}]
[null,"6 lentelė. VS išlaidų augimo ribojimo taisyklė",null,null,null,null,null,"Table 6. GG expenditure growth limiting rule"]
[null,"Nr.","VS išlaidų augimo ribojimo taisyklės netaikymo aplinkybės","Formulė",null,"Išvada",null,"No.","GG expenditure growh limiting rule application escape clause","Formula",null,"Conclusion"]
[null,null,"Institucija, kurios projekcijų pagrindu atliekama analizė",null,null,"FM","IFI",null,"Institution, projections of which are used for the analysis",null,null,"MoF","IFI"]
[null,"A1","Pagal 4 paskutinius metų ketvirčius apskaičiuotas Lietuvos BVP to meto kainomis augimas yra mažesnis negu daugiametis ES BVP to meto kainomis augimas, padidintas 2 procentiniais punktais",null,null,{"$f":"IF(L6,\"Tiesa\",\"Netiesa\")","v":"Netiesa"},{"$f":"IF(M6,\"Tiesa\",\"Netiesa\")","v":"Netiesa"},"E1","Lithuanian GDP at current prices calculated on the basis of 4 last quarters of the year grows at a slower pace than the multi-annual growth of the GDP of the EU at current prices increased by 2 percentage points",null,null,{"$f":"IF('6. GGexpenditure'!L44+eps<AVERAGE('2. Macro'!I33:M33)+2,TRUE,FALSE)","v":false},{"$f":"IF('6. GGexpenditure'!M44+eps<AVERAGE('2. Macro'!I33:M33)+2,TRUE,FALSE)","v":false}]
[null,null,null,null,null,{"$f":"CONCATENATE(TEXT(ROUND('6. GGexpenditure'!L44,1),\"0,0;–0,0\"),IF(L6,\" < \",\" ≥ \"),TEXT(ROUND(AVERAGE('2. Macro'!I33:M33)+2,1),\"0,0;–0,0\"))","v":"7,1 ≥ 5,2"},{"$f":"CONCATENATE(TEXT(ROUND('6. GGexpenditure'!M44,1),\"0,0;–0,0\"),IF(M6,\" < \",\" ≥ \"),TEXT(ROUND(AVERAGE('2. Macro'!I33:M33)+2,1),\"0,0;–0,0\"))","v":"7,1 ≥ 5,2"},null,null,null,null,{"$f":"CONCATENATE(TEXT(ROUND('6. GGexpenditure'!L44,1),\"0.0;–0.0\"),IF(L6,\" < \",\" ≥ \"),TEXT(ROUND(AVERAGE('2. Macro'!I33:M33)+2,1),\"0.0;–0.0\"))","v":"0.7 ≥ 0.5"},{"$f":"CONCATENATE(TEXT(ROUND('6. GGexpenditure'!M44,1),\"0.0;–0.0\"),IF(M6,\" < \",\" ≥ \"),TEXT(ROUND(AVERAGE('2. Macro'!I33:M33)+2,1),\"0.0;–0.0\"))","v":"0.7 ≥ 0.5"}]
[null,"A2*","A2, kai numatomas einamųjų metų VS balanso rodiklio teigiamas postūmis nėra mažesnis už suplanuotą einamųjų kalendorinių metų VS balanso rodiklio teigiamą postūmį daugiau kaip 0,5 procentinio punkto BVP to meto kainomis","B(t) ≥ B(t–1)+1  ir\nB(t–1)–B(t–2) ≥ \nBP(t–1)–BP(t–2)+0,5",null,{"$f":"IF(L8,\"Tiesa\",\"Netiesa\")","v":"Netiesa"},{"$f":"IF(M8,\"Tiesa\",\"Netiesa\")","v":"Netiesa"},"E2*","E2, when projected current year GG sector balance indicator positive adjustment is not greater than planned current year GG positive adjustment more than by 0,5 % of GDP at current prices","B(t) ≥ B(t–1)+1  and\nB(t–1)–B(t–2) ≥  \nBP(t–1)–BP(t–2)+0,5",null,{"$f":"IF(('3. GGbudget'!G7>='3. GGbudget'!F7+1)*(L38-L39>=0.5),TRUE,FALSE)","v":false},{"$f":"IF(('3. GGbudget'!K7>='3. GGbudget'!J7+1)*(M38-M39>=0.5),TRUE,FALSE)","v":false}]
[null,null,null,null,null,{"$f":"CONCATENATE(TEXT(ROUND('3. GGbudget'!H7,1),\"0,0;–0,0\"),IF(('3. GGbudget'!H7>='3. GGbudget'!F7+1),\" ≥ \",\" < \"),TEXT(ROUND('3. GGbudget'!F7+1,1),\"0,0;–0,0\"),\" ir\n\",TEXT(ROUND(F38,1),\"0,0;–0,0\"),IF(F38-F39>=0.5,\" ≥ \",\" < \"),TEXT(ROUND(F39+0.5,1),\"0,0;–0,0\"))","v":"0,3 < 1,6 ir\n0,1 < 0,8"},{"$f":"CONCATENATE(TEXT(ROUND('3. GGbudget'!L7,1),\"0,0;–0,0\"),IF(('3. GGbudget'!L7>='3. GGbudget'!J7+1),\" ≥ \",\" < \"),TEXT(ROUND('3. GGbudget'!J7+1,1),\"0,0;–0,0\"),\" ir\n\",TEXT(ROUND(G38,1),\"0,0;–0,0\"),IF(G38-G39>=0.5,\" ≥ \",\" < \"),TEXT(ROUND(G39+0.5,1),\"0,0;–0,0\"))","v":"0,3 < 1,6 ir\n0,1 < 0,8"},null,null,null,null,{"$f":"CONCATENATE(TEXT(ROUND('3. GGbudget'!H7,1),\"0.0;–0.0\"),IF(('3. GGbudget'!H7>='3. GGbudget'!F7+1),\" ≥ \",\" < \"),TEXT(ROUND('3. GGbudget'!F7+1,1),\"0.0;–0.0\"),\" ir\n\",TEXT(ROUND(F38,1),\"0.0;–0.0\"),IF(F38-F39>=0.5,\" ≥ \",\" < \"),TEXT(ROUND(F39+0.5,1),\"0.0;–0.0\"))","v":"0.0 < 0.2 ir\n0.0 < 0.1"},{"$f":"CONCATENATE(TEXT(ROUND('3. GGbudget'!L7,1),\"0.0;–0.0\"),IF(('3. GGbudget'!L7>='3. GGbudget'!J7+1),\" ≥ \",\" < \"),TEXT(ROUND('3. GGbudget'!J7+1,1),\"0.0;–0.0\"),\" ir\n\",TEXT(ROUND(G38,1),\"0.0;–0.0\"),IF(G38-G39>=0.5,\" ≥ \",\" < \"),TEXT(ROUND(G39+0.5,1),\"0.0;–0.0\"))","v":"0.0 < 0.2 ir\n0.0 < 0.1"}]
[null,"A2","Numatomas VS balanso rodiklio postūmis yra teigiamas ir sudaro bent 1,0 procentinį punktą BVP","B(t) ≥ B(t–1)+1",null,{"$f":"IF(L10,\"Tiesa\",\"Netiesa\")","v":"Netiesa"},{"$f":"IF(M10,\"Tiesa\",\"Netiesa\")","v":"Netiesa"},"E2","Projected GG sector balance indicator adjustment is positive and makes up at least 1.0 percentage point of GDP","B(t) ≥ B(t–1)+1",null,{"$f":"IF('3. GGbudget'!H7>=-0.4+1,TRUE,FALSE)","v":false},{"$f":"IF('3. GGbudget'!L7>='3. GGbudget'!J7+1,TRUE,FALSE)","v":false}]
[null,null,null,null,null,{"$f":"CONCATENATE(TEXT(ROUND('3. GGbudget'!H7-'3. GGbudget'!F7,1),\"0,0;–0,0\"),IF(L10,\" ≥ \",\" < \"),TEXT(ROUND(1,1),\"0,0;–0,0\"))","v":"–0,3 < 1,0"},{"$f":"CONCATENATE(TEXT(ROUND('3. GGbudget'!L7-'3. GGbudget'!J7,1),\"0,0;–0,0\"),IF(M10,\" ≥ \",\" < \"),TEXT(ROUND(1,1),\"0,0;–0,0\"))","v":"–0,3 < 1,0"},null,null,null,null,{"$f":"CONCATENATE(TEXT(ROUND('3. GGbudget'!H7-'3. GGbudget'!F7,1),\"0.0;–0.0\"),IF(L10,\" ≥ \",\" < \"),TEXT(ROUND(1,1),\"0.0;–0.0\"))","v":"–0.0 < 0.1"},{"$f":"CONCATENATE(TEXT(ROUND('3. GGbudget'!L7-'3. GGbudget'!J7,1),\"0.0;–0.0\"),IF(M10,\" ≥ \",\" < \"),TEXT(ROUND(1,1),\"0.0;–0.0\"))","v":"–0.0 < 0.1"}]
[null,"A3","Ne mažiau kaip penkerių iš eilės einančių metų VS balanso rodiklio aritmetinis vidurkis yra perteklius, ne mažesnis negu 0,1 procento BVP",null,null,{"$f":"IF(L12,\"Tiesa\",\"Netiesa\")","v":"Tiesa"},{"$f":"IF(M12,\"Tiesa\",\"Netiesa\")","v":"Tiesa"},"E3","The arithmetic average of GG sector balance indicator of at least five successive years is in surplus, at least 0.1 % of GDP",null,null,{"$f":"IF(ROUND(AVERAGE('2. Macro'!J37:N37),1)>=0.1,TRUE,FALSE)","v":true},{"$f":"IF(ROUND(AVERAGE('2. Macro'!I36:M36),1)>=0.1,TRUE,FALSE)","v":true}]
[null,null,null,null,null,{"$f":"CONCATENATE(TEXT(ROUND(AVERAGE('2. Macro'!I37:M37),1),\"0,0;–0,0\"),IF(L12,\" ≥ \",\" < \"),\"0,1\")","v":"0,1 ≥ 0,1"},{"$f":"CONCATENATE(TEXT(ROUND(AVERAGE('2. Macro'!I36:M36),1),\"0,0;–0,0\"),IF(M12,\" ≥ \",\" < \"),\"0,1\")","v":"0,1 ≥ 0,1"},null,null,null,null,{"$f":"CONCATENATE(TEXT(ROUND(AVERAGE('2. Macro'!I37:M37),1),\"0.0;–0.0\"),IF(L12,\" ≥ \",\" < \"),\"0,1\")","v":"0.0 ≥ 0,1"},{"$f":"CONCATENATE(TEXT(ROUND(AVERAGE('2. Macro'!I36:M36),1),\"0.0;–0.0\"),IF(M12,\" ≥ \",\" < \"),\"0.1\")","v":"0.0 ≥ 0.1"}]
[null,"A4","Keičiant einamųjų metų bet kurio iš VS priskiriamų biudžetų, kurių kiekvieno atskirai planuojami asignavimai viršija 3 procentus BVP to meto kainomis, pajamas ar išlaidas, pakeistas VS balansas nepablogės, palyginti su buvusiu prieš keitimą","B**(t–1) ≥ B(t–1)",null,"Netaikoma",{"$f":"F14","v":"Netaikoma"},"E4","If planned current year GG sector budgets, the planned appropriations of each of which exceed 3 % of GDP at current prices, are subject to amendment,  the adjusted aggregate balances of the GG budgets is not worse than the one before the amendment","B**(t–1) ≥ B(t–1)",null,"Not applied",{"$f":"L14","v":"Not applied"}]
[null,"A5","Pagal Vyriausybės arba jos įgaliotos institucijos viešai paskelbtą ekonominės raidos scenarijų, dėl kurio tvirtinimo kontrolės institucija paskelbė išvadą, apskaičiuotas produkcijos atotrūkis nuo potencialo planuojamais metais yra neigiamas","AP(t) < 0",null,{"$f":"IF(L15,\"Tiesa\",\"Netiesa\")","v":"Netiesa"},{"$f":"IF(M15,\"Tiesa\",\"Netiesa\")","v":"Netiesa"},"E5","The output gap for the planned year calculated on the basis of the economic development scenario, which is made public by the Government or its authorised institution and in regard to which the monitoring authority published its conclusion, is negative","OG(t) < 0",null,{"$f":"IF(L45+eps<0,TRUE,FALSE)","v":false},{"$f":"IF(M45+eps<0,TRUE,FALSE)","v":false}]
[null,null,null,null,null,{"$f":"CONCATENATE(TEXT(ROUND(L45,1),\"0,0;–0,0\"),IF(L15,\" < \",\" ≥ \"),FIXED(0,1))","v":"4,0 ≥ 0,0"},{"$f":"CONCATENATE(TEXT(ROUND(M45,1),\"0,0;–0,0\"),IF(M15,\" < \",\" ≥ \"),FIXED(0,1))","v":"3,5 ≥ 0,0"},null,null,null,null,{"$f":"CONCATENATE(TEXT(ROUND(L45,1),\"0.0;–0.0\"),IF(L15,\" < \",\" ≥ \"),FIXED(0,1))","v":"0.4 ≥ 0,0"},{"$f":"CONCATENATE(TEXT(ROUND(M45,1),\"0.0;–0.0\"),IF(M15,\" < \",\" ≥ \"),FIXED(0,1))","v":"0.4 ≥ 0,0"}]
[null,"A5*","A5, o prognozuojama vidutinė metinė infliacija, apskaičiuojama pagal suderintą vartotojų kainų indeksą, neviršija 3 procentų","AP(t) < 0 ir ΔSVKI(t) ≤ 3",null,{"$f":"IF(L17,\"Tiesa\",\"Netiesa\")","v":"Netiesa"},{"$f":"IF(M17,\"Tiesa\",\"Netiesa\")","v":"Netiesa"},"E5*","E5, and project annual inflation, estimated by harmonised index of consumer prices is not greater that 3 %","OG(t) < 0 and ΔHICP(t) ≤ 3",null,{"$f":"IF((F45+eps<0)*($F$46<=3),TRUE,FALSE)","v":false},{"$f":"IF((G45+eps<0)*($F$46<=3),TRUE,FALSE)","v":false}]
[null,null,null,null,null,{"$f":"CONCATENATE(TEXT(ROUND(L45,1),\"0,0;–0,0\"),IF(L15,\" < \",\" ≥ \"),FIXED(0,1), \" ir\n\", TEXT(ROUND($L$46,1),\"0,0;–0,0\"),IF(L46<=3,\" ≤ \",\" > \"), FIXED(3,1))","v":"4,0 ≥ 0,0 ir\n2,2 ≤ 3,0"},{"$f":"CONCATENATE(TEXT(ROUND(M45,1),\"0,0;–0,0\"),IF(M15,\" < \",\" ≥ \"),FIXED(0,1), \" ir\n\", TEXT(ROUND($L$46,1),\"0,0;–0,0\"),IF(L46<=3,\" ≤ \",\" > \"), FIXED(3,1))","v":"3,5 ≥ 0,0 ir\n2,2 ≤ 3,0"},null,null,null,null,{"$f":"CONCATENATE(TEXT(ROUND(L45,1),\"0.0;–0.0\"),IF($L$15,\" < \",\" ≥ \"),FIXED(0,1), \" and\n\", TEXT(ROUND($L$46,1),\"0.0;–0.0\"),IF(L46<=3,\" ≤ \",\" > \"), FIXED(3,1))","v":"0.4 ≥ 0,0 and\n0.2 ≤ 3,0"},{"$f":"CONCATENATE(TEXT(ROUND(M45,1),\"0.0;–0.0\"),IF($L$15,\" < \",\" ≥ \"),FIXED(0,1), \" and\n\", TEXT(ROUND($L$46,1),\"0.0;–0.0\"),IF(L46<=3,\" ≤ \",\" > \"), FIXED(3,1))","v":"0.4 ≥ 0,0 and\n0.2 ≤ 3,0"}]
[null,"A","t metais, VS išlaidų augimo ribojimo taisyklė netaikoma, kai susidaro bent viena iš A1–A5 aplinkybių",null,null,{"$f":"IF(L19=\"yes\",\"Taip\",\"Ne\")","v":"Taip"},{"$f":"IF(M19=\"yes\",\"Taip\",\"Ne\")","v":"Taip"},"E","at year t the GG expenditure growth limiting rule is not applied when at least one of the  E1–E5 escape clauses emerges",null,null,{"$f":"+IF((OR(L6=TRUE,L10=TRUE,L12=TRUE,L14=TRUE,L15=TRUE)),\"Yes\",\"No\")","v":"Yes"},{"$f":"+IF((OR(M6=TRUE,M10=TRUE,M12=TRUE,M14=TRUE,M15=TRUE)),\"Yes\",\"No\")","v":"Yes"}]
[null,null,null,null,null,{"$f":"IF(F19=\"TAIP\",IF(F60=1,CONCATENATE(\"Susidaro \",H55,H56,H57,H58,H59,\" aplinkybė\"),CONCATENATE(\"Susidaro \", IF(F55=1,CONCATENATE(H55,\" \"),\"\"),IF(F56=1,CONCATENATE(H56,\" \"),\"\"),IF(F57=1,CONCATENATE(H57,\" \"),\"\"),IF(F58=1,CONCATENATE(H58,\" \"),\"\"),IF(F59=1,CONCATENATE(H59,\" \"),\"\"),\"aplinkybės\")),\"Išimčių nėra\")","v":"Susidaro aplinkybės"},{"$f":"IF(G19=\"TAIP\",IF(G60=1,CONCATENATE(\"Susidaro \",I55,I56,I57,I58,I59,\" aplinkybė\"),CONCATENATE(\"Susidaro \", IF(G55=1,CONCATENATE(I55,\" \"),\"\"),IF(G56=1,CONCATENATE(I56,\" \"),\"\"),IF(G57=1,CONCATENATE(I57,\" \"),\"\"),IF(G58=1,CONCATENATE(I58,\" \"),\"\"),IF(G59=1,CONCATENATE(I59,\" \"),\"\"),\"aplinkybės\")),\"Išimčių nėra\")","v":"Susidaro aplinkybės"},null,null,null,null,{"$f":"IF(L19=\"YES\",IF(F60=1,CONCATENATE(\"Escape clause \",J55,J56,J57,J58,J59,\" emerges\"),CONCATENATE(\"Escape clauses \", IF(F55=1,CONCATENATE(J55,\" \"),\"\"),IF(F56=1,CONCATENATE(J56,\" \"),\"\"),IF(F57=1,CONCATENATE(J57,\" \"),\"\"),IF(F58=1,CONCATENATE(J58,\" \"),\"\"),IF(F59=1,CONCATENATE(J59,\" \"),\"\"),\"emerge\") ),\"There is no escape clauses\")","v":"Escape clauses emerge"},{"$f":"IF(M19=\"YES\",IF(G60=1,CONCATENATE(\"Escape clause \",K55,K56,K57,K58,K59,\" emerges\"),CONCATENATE(\"Escape clauses \", IF(G55=1,CONCATENATE(K55,\" \"),\"\"),IF(G56=1,CONCATENATE(K56,\" \"),\"\"),IF(G57=1,CONCATENATE(K57,\" \"),\"\"),IF(G58=1,CONCATENATE(K58,\" \"),\"\"),IF(G59=1,CONCATENATE(K59,\" \"),\"\"),\"emerge\") ),\"There is no escape clauses\")","v":"Escape clauses emerge"}]
[null,"Nr.","Taisyklė","Formulė",null,"Išvada",null,"No.","Rule","Formula",null,"Conclusion"]
[null,"T1","Metais t rengiant, tvirtinant ir keičiant VS priskiriamų biudžetų, kurių kiekvieno atskirai planuojami asignavimai viršija 3 proc. BVP to meto kainomis (CV, VSDF ir PSDF išlaidos), patvirtinimo įstatymų arba šių įstatymų pakeitimo įstatymų projektus, vadovaujamasi nuostata, kad tuo atveju, kai paskutinių penkerių pasibaigusių metų VS balanso rodiklių aritmetinis vidurkis yra neigiamas, šių biudžetų asignavimų (išskyrus ES finansinės paramos lėšas) visumos augimas turi būti ne didesnis negu 0,5 potencialaus BVP to meto kainomis daugiamečio augimo vidurkio","Jei ",null,{"$f":"IF((L19=\"YES\"),\"\",IF(L22,\"Tiesa\",\"Netiesa\"))","v":""},{"$f":"IF((M19=\"YES\"),\"\",IF(M22,\"Tiesa\",\"Netiesa\"))","v":""},"R1","At year t the preparation, approval and amendment of draft laws or their draft amending laws on approval of the budgets attributable to the GG sector the planned appropriations of each of which exceed 3 % of GDP (CG and SSF expenditure) at current prices shall rely on the provision that, in case where arithmetic average of GG sector balance indicators of the past five complete years is negative, the aggregate growth of the appropriations of these budgets (net of EU financial support) is not higher than 0.5 % of the average multi-annual growth rate of the potential GDP at current prices","If",null,{"$f":"IF((L19=\"YES\"),\"\",IF(AVERAGE('2. Macro'!I37:M37)+eps<0,TRUE,FALSE))","v":""},{"$f":"IF((M19=\"YES\"),\"\",IF(AVERAGE('2. Macro'!I36:M36)+eps<0,TRUE,FALSE))","v":""}]
[null,null,null,null,null,{"$f":"IF((L19=\"YES\"),\"\",CONCATENATE(TEXT(ROUND(AVERAGE('2. Macro'!H37:L37),1),\"0,0;–0,0\"),IF(L12,\" ≥ \",\" < \"),FIXED(0,1)))","v":""},{"$f":"IF((M19=\"YES\"),\"\",CONCATENATE(TEXT(ROUND(AVERAGE('2. Macro'!H37:L37),1),\"0,0;–0,0\"),IF(M12,\" ≥ \",\" < \"),FIXED(0,1)))","v":""},null,null,null,null,{"$f":"IF((L19=\"YES\"),\"\",CONCATENATE(TEXT(ROUND(AVERAGE('2. Macro'!I37:M37),1),\"0.0;–0.0\"),IF(L12,\" ≥ \",\" < \"),FIXED(0,1)))","v":""},{"$f":"IF((M19=\"YES\"),\"\",CONCATENATE(TEXT(ROUND(AVERAGE('2. Macro'!H36:L36),1),\"0.0;–0.0\"),IF(M12,\" ≥ \",\" < \"),FIXED(0,1)))","v":""}]
[null,null,null,null,null,{"$f":"L24","v":""},{"$f":"M24","v":""},null,null,null,null,{"$f":"IF(L19=\"YES\",\"\",POWER('2. Macro'!R16/'2. Macro'!G16,0.1)*POWER(PRODUCT(F40:F43),0.25)-1)","v":""},{"$f":"IF(M19=\"YES\",\"\",POWER('2. Macro'!R15/'2. Macro'!G15,0.1)*POWER(PRODUCT(F40:F43),0.25)-1)","v":""}]
[null,null,null,null,null,{"$f":"IF(F19=\"TAIP\",\"Netaikoma,\",IF(L25,\"Tiesa\",\"Netiesa\"))","v":"Netaikoma,"},{"$f":"IF(G19=\"TAIP\",\"Netaikoma,\",IF(M25,\"Tiesa\",\"Netiesa\"))","v":"Netaikoma,"},null,null,null,null,{"$f":"IF(L19=\"YES\",\"Not applied,\",IF($F$32-$F$34<=($F$33-$F$35)*(1+0.5*L24),TRUE,FALSE))","v":"Not applied,"},{"$f":"IF(M19=\"YES\",\"Not applied,\",IF($G$32-$F$34<=($G$33-$F$35)*(1+0.5*M24),TRUE,FALSE))","v":"Not applied,"}]
[null,null,null,null,null,{"$f":"IF(L19=\"YES\",\" nes susidarė viena iš KĮ numatytų netaikymo aplinkybių\",CONCATENATE(ROUND(($F$32-F34)/($F$33-F35),3),IF(L25,\" ≤ \",\" > \"), ROUND(1+0.5*L24,3)))","v":" nes susidarė viena iš KĮ numatytų netaikymo aplinkybių"},{"$f":"IF(M19=\"YES\",\" nes susidarė viena iš KĮ numatytų netaikymo aplinkybių\",CONCATENATE(ROUND(($G$32-F34)/($G$33-F35),3),IF(M25,\" ≤ \",\" > \"), ROUND(1+0.5*M24,3)))","v":" nes susidarė viena iš KĮ numatytų netaikymo aplinkybių"},null,null,null,null,{"$f":"IF(L19=\"YES\",\" since one of CL escape clauses emerged\",CONCATENATE(ROUND(($F$32-F34)/($F$33-F35),3),IF(L25,\" ≤ \",\" > \"), ROUND(1+0.5*L24,3)))","v":" since one of CL escape clauses emerged"},{"$f":"IF(M19=\"YES\",\" since one of CL escape clauses emerged\",CONCATENATE(ROUND(($G$32-F34)/($G$33-F35),3),IF(M25,\" ≤ \",\" > \"), ROUND(1+0.5*M24,3)))","v":" since one of CL escape clauses emerged"}]
[null,"T2","Pagal FDĮ panaši į T1 išlaidų ribojimo taisyklė turi būti pritaikyta visam konsoliduotam VS biudžetui (be Europos Sąjungos finansinės paramos lėšų)",null,null,{"$f":"IF(F19=\"TAIP\",\"Netaikoma,\",IF(L27,\"Tiesa\",\"Netiesa\"))","v":"Netaikoma,"},{"$f":"IF(G19=\"TAIP\",\"Netaikoma,\",IF(M27,\"Tiesa\",\"Netiesa\"))","v":"Netaikoma,"},"R2","According to FDL a similar to R1 GG consolidated budget's expenditure growth rule is applied (net of EU financial support) ",null,null,{"$f":"IF(L19=\"YES\",\"Not applied,\",IF($F$36-$F$34<=($F$37-$F$35)*(1+0.5*L24),TRUE,FALSE))","v":"Not applied,"},{"$f":"IF(M19=\"YES\",\"Not applied,\",IF($F$36-$F$34<=($F$37-$F$35)*(1+0.5*M24),TRUE,FALSE))","v":"Not applied,"}]
[null,null,null,null,null,{"$f":"IF(L19=\"YES\",\" nes susidarė viena iš FDĮ numatytų netaikymo aplinkybių\",CONCATENATE(ROUND(($F$36-$F$34)/($F$37-$F$35),3),IF(L25,\" ≤ \",\" > \"), ROUND(1+0.5*L24,3)))","v":" nes susidarė viena iš FDĮ numatytų netaikymo aplinkybių"},{"$f":"IF(M19=\"YES\",\" nes susidarė viena iš FDĮ numatytų netaikymo aplinkybių\",CONCATENATE(ROUND(($G$36-$F$34)/($G$37-$F$35),3),IF(M25,\" ≤ \",\" > \"), ROUND(1+0.5*M24,3)))","v":" nes susidarė viena iš FDĮ numatytų netaikymo aplinkybių"},null,null,null,null,{"$f":"IF(L19=\"YES\",\" since one of FDL escape clauses emerged\",CONCATENATE(ROUND(($F$36-$F$34)/($F$37-$F$35),3),IF(L25,\" ≤ \",\" > \"), ROUND(1+0.5*L24,3)))","v":" since one of FDL escape clauses emerged"},{"$f":"IF(M19=\"YES\",\" since one of FDL escape clauses emerged\",CONCATENATE(ROUND(($G$36-$F$34)/($G$37-$F$35),3),IF(M25,\" ≤ \",\" > \"), ROUND(1+0.5*M24,3)))","v":" since one of FDL escape clauses emerged"}]
[null,null,"* nelygybės ženklas yra griežtas, jei skirtumas tarp lyginamų pusių po apvalinimo sudaro bent 0,1, \nkitaip ženklas interpretuojamas kaip =\n** einamaisiais metais keičiamas VS balansas",null,null,null,null,null,"* inequality sign is strict, if a difference between both compared sides after rounding is at least 0,1, \n else the sign is interpreted as =\n** the adjusted aggregate balances of the GG budgets"]
[null,null,"Šaltiniai: KĮ 3 straipsnis 3 dalis, taisyklės pažymėtos * FDĮ 2-3 straipsniai",null,null,null,null,null,"Source: CL Article 3(3), rules denoted by * FDL Articles 2 and 3"]
[null,null,null,null,"t =",2019,null,null,null,null,"t =",{"$f":"F31","v":2019}]
[null,null,null,null,"AV3(t) =",{"$f":"'3. GGbudget'!I14","v":15046.6381},{"$f":"'3. GGbudget'!M14","v":15046.6381},null,null,null,"AG3(t) =",15046.6381,{"$f":"G32","v":15046.6381}]
[null,null,null,null,"AV3(t–1) =",{"$f":"'3. GGbudget'!G14","v":13965.20521781},{"$f":"'3. GGbudget'!K14","v":13965.20521781},null,null,null,"AG3(t–1) =",13965.20521781,{"$f":"G33","v":13965.20521781}]
[null,null,null,null,"ES(t) =",1862.3230000000001,null,null,null,null,"EU(t) =",1862.3230000000001]
[null,null,null,null,"ES(t–1) =",1560.9015999999999,null,null,null,null,"EU(t–1) =",1560.9015999999999]
[null,null,null,null,"VI(t) =",{"$f":"'3. GGbudget'!I11","v":16894.404999999999},{"$f":"'3. GGbudget'!M11","v":16894.404999999999},null,null,null,"TE(t) =",16894.404999999999,{"$f":"G36","v":16894.404999999999}]
[null,null,null,null,"VI(t–1) =",{"$f":"'3. GGbudget'!G11","v":15411.303},{"$f":"'3. GGbudget'!K11","v":15411.303},null,null,null,"TE(t–1) =",15411.303,{"$f":"G37","v":15411.303}]
[null,null,null,null,"B(t–1)–B(t–2) =",{"$f":"+'2. Macro'!M37-'2. Macro'!L37","v":0.14614688746204585},{"$f":"+'2. Macro'!M36-'2. Macro'!L36","v":0.14614688746204585},null,null,null,"B(t–1)–B(t–2) =",0.14614688746204585,{"$f":"G38","v":0.14614688746204585}]
[null,null,null,null,"BP(t–1)–BP(t–2) =",{"$f":"+('2. Macro'!M37-'2. Macro'!L37)-('2. Macro'!L37-'2. Macro'!M37)","v":0.2922937749240917},{"$f":"+('2. Macro'!M36-'2. Macro'!L36)-('2. Macro'!L36-'2. Macro'!M36)","v":0.2922937749240917},null,null,null,"BP(t–1)–BP(t–2) =",0.2922937749240917,{"$f":"G39","v":0.2922937749240917}]
[null,null,"2019 m. rudens ERS ",null,"PY1(t)/PY1(t–1) =",1.0333892616421152,null,null,null,null,"PY1(t)/PY1(t–1) =",1.0333892616421152]
[null,null,"2019 m. pavasario ERS",null,"PY2(t)/PY2(t–1) =",1.0225016001755991,null,null,null,null,"PY2(t)/PY2(t–1) =",1.0225016001755991]
[null,null,"2018 m. rudens ERS",null,"PY3(t)/PY3(t–1) =",1.0264981527722945,null,null,null,null,"PY3(t)/PY3(t–1) =",1.0264981527722945]
[null,null,"2018 m. pavasario ERS",null,"PY4(t)/PY4(t–1) =",1.020217777031311,null,null,null,null,"PY4(t)/PY4(t–1) =",1.020217777031311]
[null,null,"2018K1-2018K4",null,"ΔYN(t–1) =",7.0994704512958471,7.0994704512958471,null,null,null,"ΔYN(t–1) =",{"$f":"F44","v":7.0994704512958471},{"$f":"G44","v":7.0994704512958471}]
[null,null,null,null,"AP(t)  =",{"$f":"'2. Macro'!N20","v":3.9719882452867061},{"$f":"'2. Macro'!N19","v":3.496572107489504},null,null,null,"OG(t) =",3.9719882452867061,{"$f":"G45","v":3.496572107489504}]
[null,null,null,null,"ΔSVKI(t) =",{"$f":"'2. Macro'!N31","v":2.2000000000000002},null,null,null,null," ΔHICP(t) =",2.2000000000000002]
[null,null,null,null,"AV3(t)–ES(t)=",{"$f":"+F32-F34","v":13184.3151},{"$f":"+G32-F34","v":13184.3151},null,null,null,"AG3(t)–EU(t)=",{"$f":"+F47","v":13184.3151},13184.3151]
[null,null,null,null,"AV3(t–1)–ES(t–1)=",{"$f":"+F33-F35","v":12404.303617810001},{"$f":"+G33-F35","v":12404.303617810001},null,null,null,"AG3(t–1)–EU(t–1)=",12404.303617810001,12404.303617810001]
[null,null,null,null,"(AV3(t)-ES(t))/(AV3(t-1)-ES(t-1))=",{"$f":"+(F47/F48-1)*100","v":6.288232747464062},{"$f":"+(G47/G48-1)*100","v":6.288232747464062},null,null,null,"(AG3(t)-EU(t))/(AG3(t-1)-EU(t-1))=",6.288232747464062,6.288232747464062]
[null,null,null,null,"Ynp10t",{"$f":"(POWER('2. Macro'!Q16/'2. Macro'!G16,0.1)*POWER(PRODUCT(F40:F43),0.25)-1)","v":2.3224842948949664E-2},{"$f":"(POWER('2. Macro'!Q15/'2. Macro'!G15,0.1)*POWER(PRODUCT(F40:F43),0.25)-1)","v":1.9860811220705044E-2},null,null,null,"Ynp10t",{"$f":"+F50","v":2.3224842948949664E-2},{"$f":"+G50","v":1.9860811220705044E-2}]
[null,null,null,null,"Šaltiniai:",null,null,null,null,null,"Sources:"]
[null,null,null,null,"Finansų ministerija","FM",null,null,null,null,"Ministry of Finance","MoF"]
[null,null,null,null,"Fiskalinė institucija","IFI",null,null,null,null,"Independent Fiscal Institution","IFI"]
[null,null,null,null,"Europos Komisija","EK",null,null,null,null,"European Commission","EC"]
[null,null,null,"A1","E1",{"$f":"(L6)*1","v":0},{"$f":"(M6)*1","v":0},{"$f":"IF(F55=1,$D55,\"\")","v":""},"",{"$f":"IF(F55=1,$E55,\"\")","v":""},""]
[null,null,null,"A2","E2",{"$f":"(L10)*1","v":0},{"$f":"(M10)*1","v":0},"","","",""]
[null,null,null,"A3","E3",null,null,null,"","",""]
[null,null,null,"A4","E4",null,null,null,"","",""]
[null,null,null,"A5","E5",null,null,null,"","",""]

{"sheet":"7. GGbudgets","index":7,"n_rows":31,"n_cols":11,"rows_kept":31,"cut":false,"hidden":false,"merged":[[8,9,8,10],[12,7,16,7],[12,6,17,6],[18,1,21,1],[18,6,21,6],[13,3,14,3],[15,3,16,3],[17,2,17,3],[21,2,21,3],[18,2,20,2],[19,4,20,4],[19,5,20,5],[8,1,11,1],[8,4,8,5],[9,3,10,3],[0,1,0,2],[12,1,17,1],[3,6,4,6],[12,2,16,2],[2,6,2,10],[2,1,2,5],[3,1,4,1],[0,6,0,7],[4,2,4,3],[4,7,4,8],[3,4,3,5],[3,9,3,10],[12,9,12,10],[15,8,16,8],[13,8,14,8],[12,4,12,5],[5,1,6,1],[5,4,5,5],[5,6,6,6],[30,4,30,5],[29,9,29,10],[30,9,30,10],[21,7,21,8],[17,7,17,8],[29,4,29,5],[23,9,23,10],[23,4,23,5],[19,9,20,9],[19,10,20,10],[18,4,18,5],[18,9,18,10],[18,7,20,7],[7,2,7,3],[7,7,7,8],[5,9,5,10],[5,7,6,7],[5,2,6,2],[11,2,11,3],[8,2,10,2],[8,6,11,6],[8,7,10,7],[11,7,11,8],[9,8,10,8]]}
[null,"↖ atgal į turinį ",null,null,null,null,"↖ back to content"]
[{"$f":"Kalba","v":"LT"}]
[null,"7 lentelė. VS priskiriamų biudžetų taisyklės",null,null,null,null,"Table 7. Rules for the budgets attributable to GG sector"]
[null,"Nr.","Taisyklė","Formulė","Išvada",null,"No.","Rule","Formula","Conclusion"]
[null,null,"Institucija, kurios projekcijų pagrindu atliekama analizė",null,"FM","IFI",null,"Institution, projections of which are used for the analysis",null,"MoF","IFI"]
[null,"T31","Nuo 2018 m. sausio 1 d. kiekvienas j-asis vietos valdžios sektoriui priskiriamas biudžetas, kurio asignavimai viršija 0,3 procentą praėjusių metų BVP to meto kainomis, turi būti planuojamas, tvirtinamas, keičiamas ir vykdomas taip, kad, sprendžiant pagal to biudžeto struktūrinį balanso rodiklį, apskaičiuotą kaupiamuoju principu, jis būtų perteklinis arba subalansuotas","t ≥ 2018",{"$f":"IF(J6,\"Tiesa\",\"Netiesa\")","v":"Tiesa"},null,"R31","From 1 January 2018 each j-th budget attributable to local government sector, planned appropriations of which exceeds 0.3 % of GDP in the preceding year at current prices, must be planned, approved, amended and implemented to be in surplus or balanced when judged by its structural balance indicator calculated on accrual basis","t ≥ 2018",{"$f":"IF((J24)>=2018,TRUE,FALSE)","v":true}]
[null,null,null,"SBj(t) ≥ 0, ꓯj","Savivaldybių biudžetų atitiktis fiskalinės drausmės taisyklėms bus vertinama 2020 m. birželį","Savivaldybių biudžetų atitiktis fiskalinės drausmės taisyklėms bus vertinama 2020 m. birželį",null,null,"SBj(t) ≥ 0, ꓯj","Will be assessed in June 2020","Will be assessed in June 2020"]
[null,null,"Taisyklė savivaldybių (j) asignavimams, kurie viršija 0,3 proc. BVP",null,null,null,null,"Rule for local governments (j) appropriations of which exceed 0.3 % of GDP"]
[null,"T32","Nuo 2018 m. sausio 1 d. PSDF biudžetas turi būti planuojamas, tvirtinamas, keičiamas ir vykdomas taip, kad, sprendžiant pagal to biudžeto struktūrinį balanso rodiklį, apskaičiuotą kaupiamuoju principu, jis būtų perteklinis arba subalansuotas","t ≥ 2018",{"$f":"IF(E24>=2018,\"Tiesa\",\"Netiesa\")","v":"Tiesa"},null,"R32","From 1 January 2018 NHIF budget must be planned, approved, amended and implemented to be in surplus or balanced when judged by its structural balance indicator calculated on accrual basis","t ≥ 2018",{"$f":"IF(J24>=2018,\"True\",\"False\")","v":"True"}]
[null,null,null,"SBPSDF(t) ≥ 0",{"$f":"IF(E28>=0,\"Tiesa\",\"Netiesa\")","v":"Netiesa"},{"$f":"IF(F28>=0,\"Tiesa\",\"Netiesa\")","v":"Netiesa"},null,null,"SBPSDF(t) ≥ 0",{"$f":"IF(J28>=0,\"True\",\"False\")","v":"False"},{"$f":"IF(K28>=0,\"True\",\"False\")","v":"False"}]
[null,null,null,null,{"$f":"CONCATENATE(TEXT(ROUND(E28,1),\"0,0;–0,0\"),IF(E28>= 0,\" ≥ \",\" < \"),FIXED(0,1))","v":"–0,1 < 0,0"},{"$f":"CONCATENATE(TEXT(ROUND(F28,1),\"0,0;–0,0\"),IF(F28>= 0,\" ≥ \",\" < \"),FIXED(0,1))","v":"–0,1 < 0,0"},null,null,null,{"$f":"CONCATENATE(TEXT(ROUND(J28,1),\"0.0;–0.0\"),IF(J28>= 0,\" ≥ \",\" < \"),FIXED(0,1))","v":"–0.0 < 0,0"},{"$f":"CONCATENATE(TEXT(ROUND(K28,1),\"0.0;–0.0\"),IF(K28>= 0,\" ≥ \",\" < \"),FIXED(0,1))","v":"–0.0 < 0,0"}]
[null,null,"Taisyklė PSDF struktūriniam biudžetui",null,{"$f":"IF(E10=\"Netiesa\",\"Netenkinama\",\"Tenkinama\")","v":"Netenkinama"},{"$f":"IF(F10=\"Netiesa\",\"Netenkinama\",\"Tenkinama\")","v":"Netenkinama"},null,"Rule for NHIF structural budget",null,{"$f":"IF(J10=\"False\",\"Not valid\",\"Valid\")","v":"Not valid"},{"$f":"IF(K10=\"False\",\"Not valid\",\"Valid\")","v":"Not valid"}]
[null,"T4","Nuo 2016 m. sausio 1 d. Lietuvos Respublikos atitinkamų metų VSDF biudžetas planuojamas, tvirtinamas, keičiamas ir vykdomas taip, kad jo struktūrinis deficitas, apskaičiuotas kaupiamuoju principu, galėtų didėti t metais, kuriems pagal Vyriausybės arba jos įgaliotos institucijos viešai paskelbtą ekonominės raidos scenarijų, dėl kurio tvirtinimo kontrolės institucija paskelbė savo išvadą, numatomas neigiamas produkcijos atotrūkis nuo potencialo","t > 2016",{"$f":"IF(J13,\"Tiesa\",\"Netiesa\")","v":"Tiesa"},null,"R4","From 1 January 2016 budget of the SSIF of the Republic of Lithuania for a year t shall be planned, approved, amended and implemented in such a way that its structural deficit calculated on accrual basis could increase only in the year when a negative output gap is projected according to the economic development scenario which is made public by the Government of the Republic of Lithuania or its authorised institutions and in regard of which the monitoring authority published its conclusion","t > 2016",{"$f":"IF(E24>2016,TRUE,FALSE)","v":true}]
[null,null,null,"AP(t) < 0",{"$f":"IF(J14,\"Tiesa\",\"Netiesa\")","v":"Netiesa"},{"$f":"IF(K14,\"Tiesa\",\"Netiesa\")","v":"Netiesa"},null,null,"OG(t) < 0 ",{"$f":"IF(J25+eps<0,TRUE,FALSE)","v":false},{"$f":"IF(K25+eps<0,TRUE,FALSE)","v":false}]
[null,null,null,null,{"$f":"CONCATENATE(TEXT(ROUND(J25,1),\"0,0;–0,0\"),IF(J25<0,\" < \",\" ≥ \"),FIXED(0,1))","v":"4,0 ≥ 0,0"},{"$f":"CONCATENATE(TEXT(ROUND(K25,1),\"0,0;–0,0\"),IF(K25<0,\" < \",\" ≥ \"),FIXED(0,1))","v":"3,5 ≥ 0,0"},null,null,null,{"$f":"CONCATENATE(TEXT(ROUND(J25,1),\"0.0;–0.0\"),IF(J25<0,\" < \",\" ≥ \"),FIXED(0,1))","v":"0.4 ≥ 0,0"},{"$f":"CONCATENATE(TEXT(ROUND(K25,1),\"0.0;–0.0\"),IF(K25<0,\" < \",\" ≥ \"),FIXED(0,1))","v":"0.4 ≥ 0,0"}]
[null,null,null,"AP(t) ≥ 0 ir\nSBVSDF(t) ≥ SBVSDF(t–1) arba SBVSDF(t) ≥ 0",{"$f":"IF((E25>=0)*(E26>=0),\"Tiesa\",\"Netiesa\")","v":"Tiesa"},{"$f":"IF((F25>=0)*(F26>=0),\"Tiesa\",\"Netiesa\")","v":"Tiesa"},null,null,"OG(t) ≥ 0 and\nSBSSIF(t) ≥ SBSSIF(t–1) or SBSSIF(t) ≥ 0",{"$f":"IF((J25>=0)*(J26>=J27),TRUE,FALSE)","v":false},{"$f":"IF((K25>=0)*(K26+eps>=K27),TRUE,FALSE)","v":false}]
[null,null,null,null,{"$f":"CONCATENATE(TEXT(ROUND(E25,1),\"0,0;–0,0\"),IF(J16<0,\" < \",\" ≥ \"),FIXED(0,1), \" ir\n\", TEXT(ROUND(E26,1),\"0,0;–0,0\"),IF(E26>=E27,\" ≥ \",\" < \"), TEXT(ROUND(E27,1),\"0,0;–0,0\"), \" arba \",TEXT(ROUND(E26,1),\"0,0;–0,0\"),IF(J16<0,\" < \",\" ≥ \"),FIXED(0,1),)","v":"4,0 ≥ 0,0 ir\n0,2 < 8,1 arba 0,2 ≥ 0,0"},{"$f":"CONCATENATE(TEXT(ROUND(F25,1),\"0,0;–0,0\"),IF(K16<0,\" < \",\" ≥ \"),FIXED(0,1), \" ir\n\", TEXT(ROUND(F26,1),\"0,0;–0,0\"),IF(F26>=F27,\" ≥ \",\" < \"), TEXT(ROUND(F27,1),\"0,0;–0,0\"), \" arba \",TEXT(ROUND(F26,1),\"0,0;–0,0\"),IF(K16<0,\" < \",\" ≥ \"),FIXED(0,1),)","v":"3,5 ≥ 0,0 ir\n0,2 < 8,2 arba 0,2 ≥ 0,0"},null,null,null,{"$f":"CONCATENATE(TEXT(ROUND(E25,1),\"0.0;–0.0\"),IF(J16<0,\" < \",\" ≥ \"),FIXED(0,1), \" ir\n\", TEXT(ROUND(E26,1),\"0.0;–0.0\"),IF(E26>=E27,\" ≥ \",\" < \"), TEXT(ROUND(E27,1),\"0.0;–0.0\"), \" arba \",TEXT(ROUND(E26,1),\"0.0;–0.0\"),IF(J16<0,\" < \",\" ≥ \"),FIXED(0,1),)","v":"0.4 ≥ 0,0 ir\n0.0 < 0.8 arba 0.0 ≥ 0,0"},{"$f":"CONCATENATE(TEXT(ROUND(F25,1),\"0.0;–0.0\"),IF(K16<0,\" < \",\" ≥ \"),FIXED(0,1), \" ir\n\", TEXT(ROUND(F26,1),\"0.0;–0.0\"),IF(F26>=F27,\" ≥ \",\" < \"), TEXT(ROUND(F27,1),\"0.0;–0.0\"), \" arba \",TEXT(ROUND(F26,1),\"0.0;–0.0\"),IF(K16<0,\" < \",\" ≥ \"),FIXED(0,1),)","v":"0.4 ≥ 0,0 ir\n0.0 < 0.8 arba 0.0 ≥ 0,0"}]
[null,null,"Taisyklė VSDF struktūriniam biudžetui",null,{"$f":"IF(OR(E15=\"Netiesa\",E16=\"Tiesa\"),\"Tenkinama\",\"Netenkinama\")","v":"Tenkinama"},{"$f":"IF(OR(F15=\"Netiesa\",F16=\"Tiesa\"),\"Tenkinama\",\"Netenkinama\")","v":"Tenkinama"},null,"Rule for SSIF structural budget",null,{"$f":"IF(OR(J14:J16),\"Valid\",\"Invalid\")","v":"Invalid"},{"$f":"IF(OR(K14:K16),\"Valid\",\"Invalid\")","v":"Invalid"}]
[null,"T5","Nuo 2016 m. sausio 1 d.  kiekvienas j-asis vietos valdžios sektoriui priskiriamas biudžetas, kurio asignavimai neviršija 0,3 procento praėjusių metų BVP to meto kainomis, turi būti planuojamas, tvirtinamas, keičiamas ir vykdomas taip, kad to biudžeto asignavimai neviršytų jo pajamų, išskyrus metus, kuriais pagal Vyriausybės arba jos įgaliotos institucijos viešai paskelbtą ekonominės raidos scenarijų, dėl kurio tvirtinimo kontrolės institucija paskelbė savo išvadą, numatomas neigiamas produkcijos atotrūkis nuo potencialo. Pastaruoju atveju asignavimai negali viršyti pajamų daugiau kaip 1,5 procento","t > 2016",{"$f":"IF(J19,\"Tiesa\",\"Netiesa\")","v":"Tiesa"},null,"R4","From 1 January 2016 each j-th budget attributable to local government sector, planned appropriations of which does not exceed 0.3 % of GDP in the preceding year at current prices, shall be planned, approved, amended and implemented in such a way that the appropriations of the budget would not exceed its revenue, with the exception of the year when a negative output gap is projected according to the economic development scenario which is made public by the Government or its authorised institution and in regard to which the monitoring authority published its conclusion. In the latter case, the appropriations may not exceed revenue by more than 1.5 %","t > 2016",{"$f":"IF(E24>2016,TRUE,FALSE)","v":true}]
[null,null,null,"AP(t) ≥ 0 ir \nVIj(t)/VPj(t) ≤ 1","Savivaldybių biudžetų atitiktis fiskalinės drausmės taisyklėms bus vertinama 2020 m. birželį","Savivaldybių biudžetų atitiktis fiskalinės drausmės taisyklėms bus vertinama 2020 m. birželį",null,null,"OG(t) ≥ 0 and\nTEj(t)/TRj(t) ≤ 1","Will be assessed in June 2020","Will be assessed in June 2020"]
[null,null,null,"AP(t) < 0 ir \nVIj(t)/VPj(t) ≤ 1,015",null,null,null,null,"OG(t) < 0 and\nTEj(t)/TRj(t) ≤ 1,015"]
[null,null,"Taisyklė savivaldybių (j) asignavimams, kurie neviršija 0,3 proc. BVP",null,null,null,null,"Rule for local governments (j) appropriations of which does not exceed 0.3 % of GDP"]
[null,null,"Šaltinis: KĮ 4 straipsnis",null,null,null,null,"Source: CL Article 4"]
[null,null,null,"t =",2019,null,null,null,"t =",{"$f":"E24","v":2019}]
[null,null,null,"AP(t) =",{"$f":"'2. Macro'!N20","v":3.9719882452867061},{"$f":"'2. Macro'!N19","v":3.496572107489504},null,null,"OG(t) =",{"$f":"E25","v":3.9719882452867061},{"$f":"F25","v":3.496572107489504}]
[null,null,null,"SBVSDF(t) =",{"$f":"'3. GGbudget'!H20","v":0.17269056681031375},{"$f":"'3. GGbudget'!L20","v":0.22070759672783113},null,null,"SBSSIF(t) =",{"$f":"E26","v":0.17269056681031375},{"$f":"F26","v":0.22070759672783113}]
[null,null,null,"SBVSDF(t–1) =",{"$f":"'3. GGbudget'!F20","v":8.0986797867698161},{"$f":"'3. GGbudget'!J20","v":8.2357289100481665},null,null,"SBSSIF(t–1) =",{"$f":"E27","v":8.0986797867698161},{"$f":"F27","v":8.2357289100481665}]
[null,null,null,"SBPSDF(t) =",{"$f":"'3. GGbudget'!H21","v":-0.11493577978762406},{"$f":"'3. GGbudget'!L21","v":-9.3542053586749968E-2},null,null,"SBNHIF(t–1) =",{"$f":"E28","v":-0.11493577978762406},{"$f":"F28","v":-9.3542053586749968E-2}]
[null,null,null,"Šaltiniai:",null,null,null,null,"Sources:"]
[null,null,null,"Finansų ministerija","FM",null,null,null,"Ministry of Finance","MoF"]
[null,null,null,"Fiskalinė institucija","IFI",null,null,null,"Independent Fiscal Institution","IFI"]