{"text_format":"1","workbook":"xlsx","n_sheets":8,"sheets":["Tech","Turinys","Savivaldybės","1 lentelė","2 lentelė ","3 lentelė","1 pav.","2 pav."],"not_rendered":{"charts":2,"images":4,"macros":1,"external_links":4,"defined_names":22,"comments":0,"pivot_tables":0},"unopened":[],"bounds":{"document_bytes":16777216,"sheet_cells":100000,"rows_first":2000,"rows_last":500,"rows_between":2000,"halvings":0,"cell_chars":16384,"cell_head_chars":4096},"cells_cut":0,"cells_raw":0,"read":"whole","date_system":"1900"}

{"sheet":"Tech","index":0,"n_rows":2,"n_cols":1,"rows_kept":2,"cut":false,"hidden":true,"merged":[]}
["LT"]
["EN"]

{"sheet":"Turinys","index":1,"n_rows":28,"n_cols":7,"rows_kept":28,"cut":false,"hidden":false,"merged":[[21,2,21,3],[21,5,21,7],[11,5,11,7],[15,5,15,7],[0,2,0,4],[11,2,11,3],[15,2,15,3],[5,2,5,3],[7,2,7,3],[3,2,3,3],[3,5,3,7],[7,5,7,7]]}
[]
[null,"LT","◄","Switch to English",null,"◄","Rodyti lietuviškai"]
[]
[null,null,"SAVIVALDYBIŲ FISKALINĖS DRAUSMĖS TAISYKLIŲ LAIKYMOSI SKAIČIUOKLĖ",null,null,"SPREADSHEET OF THE FULFILMENT OF FISCAL DISCIPLINE RULES  "]
[]
[null,null,"2019-07 BPE-3",null,null,null,"2019-07 BPE-3"]
[]
[null,null,"APRAŠYMAS",null,null,"DESCRIPTION"]
[]
[null,null,null,"Fiskalinės sutarties įgyvendinimo konstituciniame įstatyme Nr. XII-1289 (toliau − KĮ) nustatytų fiskalinės drausmės taisyklių skaičiuoklė skirta skaidriai parodyti fiskalinės drausmės taisykles, pagal kurias priimami sprendimai. 1 dalis pateikia skaičiavimams reikalingų duomenų įvestis ir nurodo šių duomenų šaltinius. 2 dalyje nagrinėjamos dvi taisyklių grupės: savivaldybių, kurių asignavimai viršija arba yra lygūs 0,3 proc. ir savivaldybių, kurių asignavimai neviršija 0,3 proc. praėjusių metų BVP to meto kainomis",null,null,"Constitutional Law on the Implementation of the Fiscal Treaty Nr. XII-1289 (hereinafter − CL) defines fiscal discipline rules. The aim of this spreadsheet is to show the fiscal discipline rules, which are used for making decisions in a transparent way.  Part 1 provides required input data with their appropriate sources. In part 2 two groups of the fiscal rules are validated: municipalities which expenditures are above or equal 0.3 and municipalities which expenditures are below 0.3% of GDP at current prices of previous year."]
[]
[null,null,"1. DUOMENYS",null,null,"1 . DATA"]
[]
[null,null,null,{"$f":"Savivaldybės!B4","v":"Savivaldybių 2019 m. biudžetų duomenys"},null,null,{"$f":"+Savivaldybės!B4","v":"Savivaldybių 2019 m. biudžetų duomenys"}]
[]
[null,null,"2. FISKALINĖS DRAUSMĖS TAISYKLĖS",null,null,"2. FISCAL RULES"]
[]
[null,null,null,{"$f":"+'1 lentelė'!B4","v":"1 lentelė. Savivaldybių biudžetų fiskalinės drausmės taisyklės, 2019 m."},null,null,{"$f":"'1 lentelė'!F4","v":""}]
[null,null,null,{"$f":"+'2 lentelė '!B8","v":"2 lentelė. Savivaldybių 2019 m. biudžetai, kuriems taikoma Konstitucinio įstatymo 4 str. 2 d."},null,null,{"$f":"'2 lentelė '!B5","v":""}]
[null,null,null,{"$f":"'3 lentelė'!B7","v":"3 lentelė. Savivaldybių 2019 m. biudžetai, kuriems taikoma Konstitucinio įstatymo 4 str. 4 d."},null,null,{"$f":"'3 lentelė'!B3","v":""}]
[]
[null,null,"3. PAVEIKSLAI",null,null,"2. FISCAL RULES"]
[]
[null,null,null,{"$f":"+'1 pav.'!B4:B4","v":"1 pav. Skirtumai tarp savivaldybių Finansų ministerijai pateiktų ir fiskalinei institucijai patikslintų duomenų apie nepanaudotą praėjusių metų pajamų dalį"},null,null,{"$f":"'1 pav.'!B4","v":"1 pav. Skirtumai tarp savivaldybių Finansų ministerijai pateiktų ir fiskalinei institucijai patikslintų duomenų apie nepanaudotą praėjusių metų pajamų dalį"}]
[null,null,null,{"$f":"+'2 pav.'!B4","v":"2 pav. Savivaldybių 2019 m. biudžetų fiskalinės drausmės taisyklių laikymosi vertinimas"},null,null,{"$f":"'2 pav.'!B4","v":"2 pav. Savivaldybių 2019 m. biudžetų fiskalinės drausmės taisyklių laikymosi vertinimas"}]
[]
[null,null,"KĮ","Lietuvos Respublikos fiskalinės sutarties įgyvendinimo konstitucinis įstatymas",null,"CL","Republic of Lithuania Constitutional Law on the Implementation of the Fiscal Treaty"]
[null,null,"FDĮ","Lietuvos Respublikos fiskalinės drausmės įstatymas",null,"FDL","Republic of Lithuania Fiscal Discipline Law"]

{"sheet":"Savivaldybės","index":2,"n_rows":81,"n_cols":13,"rows_kept":81,"cut":false,"hidden":false,"merged":[[5,6,6,6],[5,1,6,1],[5,2,6,2],[5,3,6,3],[5,4,6,4],[5,5,6,5],[5,7,6,7],[5,8,6,8],[5,9,6,9],[5,11,6,11],[5,12,6,12],[5,10,6,10]]}
[null,{"$f":"IF(A4=\"lt\",\"↖ atgal į turinį\",\"\")","v":"↖ atgal į turinį"}]
[null,{"$f":"IF(A4=\"en\",\"↖ back to content\",\"\")","v":""}]
[]
[{"$f":"+[0]!Kalba","v":"LT"},{"$f":"IF(A4=\"lt\",\"Savivaldybių 2019 m. biudžetų duomenys\",\"Budget attributable to local government in 2019\")","v":"Savivaldybių 2019 m. biudžetų duomenys"}]
[]
[null,{"$f":"IF(A4=\"LT\",\"Savivaldybė\",\"Local government\")","v":"Savivaldybė"},{"$f":"IF(A4=\"LT\",\"Kodas\",\"Code\")","v":"Kodas"},{"$f":"IF(A4=\"LT\",\"Asignavimai, proc. BVP\",\"Appropriations, % of GDP\")","v":"Asignavimai, proc. BVP"},{"$f":"IF(A4=\"LT\",\"εi, pot. BVP\",\"εi, pot. GDP\")","v":"εi, pot. BVP"},{"$f":"IF(A4=\"LT\",\"εi, pot. BVP\",\"εi, pot. GDP\")","v":"εi, pot. BVP"},{"$f":"IF(A4=\"LT\",\"Pajamos, tūkst. EUR\",\"Revenues, thousands EUR\")","v":"Pajamos, tūkst. EUR"},{"$f":"IF(A4=\"LT\",\"Asignavimai, tūkst. EUR\",\"Expenditures, thousands EUR\")","v":"Asignavimai, tūkst. EUR"},{"$f":"IF(A4=\"LT\",\"Balansas, tūkst. EUR\",\"Balance, thousands EUR\")","v":"Balansas, tūkst. EUR"},{"$f":"IF(A4=\"LT\",\"Nepanaudota praėjusių metų pajamų dalis (2018-12-31), tūkst. EUR\",\"Revenue, carried forward to the following budget year (31/12/2018), thousands EUR\")","v":"Nepanaudota praėjusių metų pajamų dalis (2018-12-31), tūkst. EUR"},{"$f":"IF(A4=\"LT\",\"Nepanaudota praėjusių metų pajamų dalis (2018-12-31), tūkst. EUR pagal savivaldybių patikslintus duomenis\",\"Revenue, carried forward to the following budget year (31/12/2018), thousands EUR according to the updated data provided by local government\")","v":"Nepanaudota praėjusių metų pajamų dalis (2018-12-31), tūkst. EUR pagal savivaldybių patikslintus duomenis"},{"$f":"IF(A4=\"LT\",\"Mokėtinų sumų metinis pokytis, tūkst. EUR\",\"Change in accounts payable, thousands EUR\")","v":"Mokėtinų sumų metinis pokytis, tūkst. EUR"},{"$f":"IF(A4=\"LT\",\"Asignavimų dalis nuo visų valdžios sektoriaus išlaidų, proc.\", \"Share of approprations to total expenditure, %\")","v":"Asignavimų dalis nuo visų valdžios sektoriaus išlaidų, proc."}]
[]
[null,"Vilniaus m.",1,{"$f":"H8/$C$72/10","v":1.4535414964466662},{"$f":"IF(D8>0.3,H8/$C$74/1000*$C$76,0)","v":1.5883828900371252E-2},{"$f":"IF(D8>0.3,H8/$D$74/1000*$D$76,0)","v":1.5898468288072513E-2},642064.30000000005,{"$f":"554170.7+100987.5+590.1","v":655748.29999999993},{"$f":"ROUND(G8-H8,1)","v":-13684},39584.400000000001,39584.5,{"$f":"38155.5-38100","v":55.5},{"$f":"H8/1000/$C$74*100","v":3.8459634141334758}]
[null,"Alytaus m.",2,0.13954655193235058,0,0,58615.9,{"$f":"52077.5+10877.3","v":62954.8},{"$f":"ROUND(G9-H9,1)","v":-4338.8999999999996},4900.7,4900.7,null,0.36922986692316268]
[null,"Birštono m.",3,2.1168229613048747E-2,0,0,8999.1,{"$f":"8215.8+1334","v":9549.7999999999993},-550.70000000000005,97.1,551.70000000000005,null,5.6009571679090694E-2]
[null,"Druskininkų m.",4,4.9610946225207779E-2,0,0,20662.599999999999,{"$f":"19294.6+3086.8","v":22381.399999999998},-1718.8,0,1718.8,null,0.13126689852964463]
[null,"Kauno m.",5,0.69402768774420365,7.5841089306346501E-3,7.591098851748794E-3,289128,{"$f":"268401.4+44701.1","v":313102.5},-23974.5,23974.5,23974.5,{"$f":"4657.5-4638","v":19.5},1.8363459880471313]
[null,"Klaipėdos m.",6,0.45032705339808804,4.9210276300123753E-3,4.9255631127235154E-3,183555.4,{"$f":"161562.3+41184.9+412.6","v":203159.8},-19604.400000000001,26724.6,26724.6,{"$f":"1832-2163.6","v":-331.59999999999991},1.1915321138044492]
[null,"Marijampolės m.",7,0.10646579016297952,0,0,48528,{"$f":"46161+1869.8","v":48030.8},497.2,686.4,483.8,null,0.28170061523844164]
[null,"Neringos m.",8,2.4861331809775435E-2,0,0,9688.7000000000007,{"$f":"9957.9+1258","v":11215.9},-1527.2,1702.2,1702.2,null,6.5781247250781508E-2]
[null,"Palangos m.",9,5.442942384074375E-2,0,0,24607.1,{"$f":"21510.7+3096.4-51.9","v":24555.200000000001},51.9,627.79999999999995,627.79999999999995,null,0.14401623431845773]
[null,"Panevėžio m.",10,0.2278644720364856,0,0,102956.6,{"$f":"78851.4+23955.2-8.2","v":102798.39999999999},158.19999999999999,2668.3,2668.3,null,0.60291255872330696]
[null,"Šiaulių m.",11,0.34074691920629813,3.7235715500607029E-3,3.727003393094056E-3,137940.1,{"$f":"107412.7+46311.3","v":153724},-15783.9,14835.9,14835.9,0,0.90159117434883829]
[null,"Visagino m.",12,6.1654923649080574E-2,0,0,24145.5,{"$f":"22656.4+5158.5","v":27814.9},-3669.4,3734.7,3734.7,null,0.1631343730022346]
[null,"Akmenės r.",13,6.4872783596855693E-2,0,0,26731.7,{"$f":"23017.7+6248.9","v":29266.6},-2534.9,399.5,2534.9,null,0.17164859269338367]
[null,"Alytaus r.",14,5.4663941704265563E-2,0,0,20877.099999999999,{"$f":"20752.1+3908.9","v":24661},-3783.9,4499.2,{"$f":"4499.2","v":4499.2},null,0.14463675125950864]
[null,"Anykščių r.",15,6.0284390614907278E-2,0,0,25945.1,{"$f":"23282+3914.6","v":27196.6},-1251.5,0,1251.5,null,0.15950804384673584]
[null,"Biržų r.",16,5.9713612260872642E-2,0,0,25615.3,{"$f":"23297.3+3641.8","v":26939.1},-1323.8,972.4,1416.5,null,0.15799780649020839]
[null,"Ignalinos r.",17,3.7599553041351721E-2,0,0,15875.6,{"$f":"15618.6+1344","v":16962.599999999999},-1087,0,1086.9000000000001,null,9.9485639548864246E-2]
[null,"Jonavos r.",18,0.10906432788893997,0,0,46393.2,{"$f":"41247.7+8042.7-87.3","v":49203.099999999991},-2809.9,3574.7,3574.7,null,0.28857615408526532]
[null,"Joniškio r.",19,5.102315162076302E-2,0,0,22099.5,{"$f":"21760.8+1257.7","v":23018.5},-919,449.3,919,null,0.13500348967466849]
["-","Jurbarko r.",20,6.2760792856179151E-2,0,0,26395.9,{"$f":"25608.2+2705.6","v":28313.8},-1917.9,2037.2,2037.2,null,0.16606042122426001]
["-","Kaišiadorių r.",21,7.1429752331107682E-2,0,0,31200.1,{"$f":"27544.7+4680","v":32224.7},-1024.5999999999999,332.9,{"$f":"1286.1+119.9","v":1406},null,0.18899784754520449]
[null,"Kauno r.",22,0.18861154589115553,0,0,83141.5,{"$f":"68967.1+16122.8","v":85089.900000000009},-1948.4,0,2109.4,null,0.49905221609003964]
[null,"Kėdainių r.",23,0.13286545275993961,0,0,53225.2,{"$f":"46777.1+13163.6","v":59940.7},-6715.5,4848.2,7078.3,null,0.35155217210254364]
[null,"Kelmės r.",24,7.3176444925202033E-2,0,0,31143.4,{"$f":"26579+6433.7","v":33012.699999999997},-1869.3,1423.7,1423.7,null,0.19361946710615061]
[null,"Klaipėdos r.",25,0.12685886952202471,0,0,55843.7,{"$f":"48233.4+8997.5","v":57230.9},-1387.2,1513,1513,null,0.33565919661237631]
[null,"Kretingos r.",26,9.4464150084978799E-2,0,0,39885.300000000003,{"$f":"33650.1+8966.3","v":42616.399999999994},-2731.1,0,1755.6,null,0.24994516225520955]
[null,"Kupiškio r.",27,4.0220256916983416E-2,0,0,17759.8,{"$f":"16948.1+1196.8","v":18144.899999999998},-385.1,556.9,556.9,null,0.10641982839011629]
[null,"Lazdijų r.",28,4.8480915914967539E-2,0,0,21205.9,{"$f":"20239.8+1631.8","v":21871.599999999999},-665.7,1394.5,1394.5,null,0.12827692181369241]
[null,"Mažeikių r.",30,0.13679528943515523,0,0,59737.9,{"$f":"54134.6+7579","v":61713.599999999999},-1975.7,2454,2454,null,0.36195022961472822]
[null,"Molėtų r.",31,4.5639880511603635E-2,0,0,19930.400000000001,{"$f":"17389.1+3200.8","v":20589.899999999998},-659.5,682.3,682.3,null,0.12075975202782353]
[null,"Pakruojo r.",32,4.7522673264679474E-2,0,0,20990.6,{"$f":"20556.9+897.8-15.4","v":21439.3},-448.7,0,495.4,null,0.12574148255455916]
[null,"Panevėžio r.",33,8.3652167259834015E-2,0,0,36549.699999999997,{"$f":"31344.8+6393.9","v":37738.699999999997},-1189,2565.5,2565.5,null,0.22133745447294179]
[null,"Pasvalio r.",34,5.8476962770713702E-2,0,0,25837.599999999999,{"$f":"24782.7+1598.5","v":26381.200000000001},-543.6,543.6,543.6,null,0.1547257233010563]
[null,"Plungės r.",35,8.6671861829548169E-2,0,0,37835.1,{"$f":"30828.7+8272.3","v":39101},-1265.9000000000001,1265.9000000000001,1265.9000000000001,null,0.22932734321390238]
[null,"Prienų r.",36,5.6053537627156112E-2,0,0,25099.1,{"$f":"24057.4+1230.5","v":25287.9},-188.8,632.20000000000005,871.8,null,0.14831351941021567]
[null,"Radviliškio r.",37,9.0623642992938319E-2,0,0,36498.300000000003,{"$f":"37546.1+3337.7","v":40883.799999999996},-4385.5,525.79999999999995,4385.5,null,0.2397834642205709]
[null,"Raseinių r.",38,7.0728858678502787E-2,0,0,31381.9,{"$f":"30044.8+1893.6-29.9","v":31908.499999999996},-526.6,1183.7,{"$f":"770.6+276.7","v":1047.3},null,0.1871433347213832]
[null,"Rokiškio r.",39,6.4584623651129464E-2,0,0,28364.400000000001,{"$f":"28879.2+257.4","v":29136.600000000002},-772.2,772.2,772.2,null,0.17088614276581646]
[null,"Skuodo r.",40,4.1570397093459152E-2,0,0,18109,{"$f":"16342.1+2411.9","v":18754},-645,643.70000000000005,645,null,0.10999219955074105]
[null,"Šakių r.",41,6.5078263804308173E-2,0,0,28544.2,{"$f":"27084.7+2274.6","v":29359.3},-815.1,832.6,{"$f":"832.6+390.4","v":1223},null,0.17219227814173357]
[null,"Šalčininkų r.",42,6.7620056187110228E-2,0,0,30325.200000000001,{"$f":"30037.4+468.6","v":30506},-180.8,741.8,741.8,null,0.17891767300282108]
[null,"Šiaulių r.",43,7.8582103845529383E-2,0,0,34648.300000000003,{"$f":"32419.9+3031.5","v":35451.4},-803.1,839.4,839.4,null,0.20792244124736808]
[null,"Šilalės r.",44,5.7810426650099257E-2,0,0,25490.9,{"$f":"22520.6+3559.9","v":26080.5},-589.6,0,1039.5999999999999,null,0.15296211796859879]
[null,"Šilutės r.",45,9.6628009615886079E-2,0,0,42425.9,{"$f":"37895.2+5697.4","v":43592.6},-1166.7,0,{"$f":"1308.1-141.3","v":1166.8},null,0.2556705747112954]
[null,"Širvintų r.",46,3.5776387230891549E-2,0,0,15542.1,{"$f":"14318.7+1821.4","v":16140.1},-598,950.8,950.8,null,9.4661677507140649E-2]
[null,"Švenčionių r.",47,6.5085800295196394E-2,0,0,28147.3,{"$f":"20877.1+8551.9-66.3","v":29362.7},-1215.4000000000001,1219.5,{"$f":"1219.5","v":1219.5},null,0.1722122191398392]
[null,"Tauragės r.",48,9.6129271248282994E-2,0,0,40770.400000000001,{"$f":"34578.2+8789.4","v":43367.6},-2597.1999999999998,2597.1999999999998,2597.1999999999998,null,0.25435094983665973]
[null,"Telšių r.",49,9.097431148073748E-2,0,0,40182.300000000003,{"$f":"37310.5+3731.5","v":41042},-859.7,612.6,859.7,null,0.24071130713242583]
[null,"Trakų r.",50,9.0540298270174444E-2,0,0,39239.800000000003,{"$f":"32729.2+8129.1-12.1","v":40846.200000000004},-1606.4,2476.9,2476.9,null,0.23956294024152069]
[null,"Ukmergės r.",51,8.1756518139948858E-2,0,0,34426.1,{"$f":"33604.9+3329.6-51","v":36883.5},-2457.4,2542.1999999999998,2542.1999999999998,null,0.21632170694943784]
[null,"Utenos r.",52,8.3024643562640971E-2,0,0,36826.6,{"$f":"33604+3851.6","v":37455.599999999999},-629,675,{"$f":"675-0.4","v":674.6},null,0.21967707313067805]
[null,"Varėnos r.",53,5.22125872121222E-2,0,0,22127.200000000001,{"$f":"21463.1+2092","v":23555.1},-1427.9,1428,1428,null,0.13815064837568841]
[null,"Vilkaviškio r.",54,8.0164545270559787E-2,0,0,34950.800000000003,{"$f":"33632.1+2533.2","v":36165.299999999996},-1214.5,1091.7,1214.5,null,0.21210946434960087]
[null,"Vilniaus  r.",55,0.19756002051343843,0,0,83128.7,{"$f":"80878.4+8248.5","v":89126.9},-5998.2,5998.2,5998.2,null,0.52272921884072421]
[null,"Zarasų r.",56,4.2067140507591826E-2,0,0,17257.900000000001,{"$f":"16290.8+2687.3","v":18978.099999999999},-1720.2,211.7,1096.8,null,0.11130654592587813]
[null,"Elektrėnų sav.",57,7.2735560208240915E-2,0,0,31901.3,{"$f":"23725.4+9095.7-7.3","v":32813.800000000003},-912.5,488.7,{"$f":"156.2+41.7","v":197.89999999999998},null,0.19245291871697273]
[null,"Kalvarijos sav.",58,2.3596531309534007E-2,0,0,10403.299999999999,{"$f":"10317.1+328.2","v":10645.300000000001},-242,0,269,null,6.2434678568705548E-2]
[null,"Kazlų Rūdos sav.",59,2.5551585710538109E-2,0,0,10974.3,{"$f":"10827.2+700.1","v":11527.300000000001},-553,31.9,558,null,6.7607608077277226E-2]
[null,"Pagėgių sav.",60,2.0595899628537119E-2,0,0,9135.2000000000007,{"$f":"8706.2+585.4","v":9291.6},-156.4,105.3,{"$f":"5.7+9.6+105.3+5.1+6.7","v":132.39999999999998},null,5.4495228822953268E-2]
[null,"Rietavo sav.",61,2.1070698554495254E-2,0,0,9216.7000000000007,{"$f":"7540.3+1965.5","v":9505.7999999999993},-289.10000000000002,0,498.3,null,5.5751511703606385E-2]
[]
[]
[null,{"$f":"IF(A4=\"LT\",\"2018 m. potencialus BVP, mln. EUR \",\"Potential GDP 2018, mil. EUR \")","v":"2018 m. potencialus BVP, mln. EUR "},36551.251193186399,36142.370048151301]
[null,{"$f":"IF(A4=\"LT\",\"2019 m. BVP projekcija, mln. EUR \",\"Nominal GDP 2019 forecast, mil. EUR \")","v":"2019 m. BVP projekcija, mln. EUR "},47369.125378066885,47369.125378066885]
[null,{"$f":"IF(A4=\"LT\",\"2018 m. BVP, mln. EUR \",\"Nominal GDP 2018, mil. EUR \")","v":"2018 m. BVP, mln. EUR "},45113.834149423667,45113.834149423667]
[null,{"$f":"IF(A4=\"LT\",\"2019 m. atotrūkis nuo potencialo, proc. pot. BVP \",\"Output gap for the year 2019, % pot. GDP \")","v":"2019 m. atotrūkis nuo potencialo, proc. pot. BVP "},1.5118463447552077,1.4804051828047164]
[null,{"$f":"IF(A4=\"LT\",\"2019 m. projektuotos valžios sektoriaus išlaidos, mln. EUR \",\"Total expenditure projected for 2019, mil. EUR \")","v":"2019 m. projektuotos valžios sektoriaus išlaidos, mln. EUR "},17050.3,17034.599999999999]
[null,{"$f":"IF(A4=\"LT\",\"2018 m. visos išlaidos, mln. EUR \",\"Total expenditure for the year 2018, mil. EUR\")","v":"2018 m. visos išlaidos, mln. EUR "},15342.75850251552,15342.75850251552]
[null,{"$f":"IF(A4=\"LT\",\"Valdžios sektoriaus biudžeto dalinis elastingumas\",\"Semi-elasticity of the GG sector \")","v":"Valdžios sektoriaus biudžeto dalinis elastingumas"},0.41299999999999998,0.41299999999999998]
[]
[null,{"$f":"IF(A4=\"LT\",\"Šaltiniai:\",\"Sources:\")","v":"Šaltiniai:"}]
[null,{"$f":"IF(A4=\"LT\",\"Finansų ministerija (FM)\",\"Ministry of Finance (MoF)\")","v":"Finansų ministerija (FM)"}]
[null,{"$f":"IF(A4=\"lt\",\"Fiskalinės institucijos skaičiavimai (IFI)\",\"Independent fiscal institution (IFI)\")","v":"Fiskalinės institucijos skaičiavimai (IFI)"}]
[null,{"$f":"IF(A4=\"lt\",\"Faktiniai duomenys\",\"Actual data\")","v":"Faktiniai duomenys"}]

{"sheet":"1 lentelė","index":3,"n_rows":14,"n_cols":9,"rows_kept":14,"cut":false,"hidden":false,"merged":[[13,5,13,8],[7,7,8,7],[7,3,8,3],[7,5,11,5],[7,6,11,6],[7,8,8,8],[13,1,13,4],[7,1,11,1],[7,2,11,2],[7,4,8,4],[12,1,12,4],[12,5,12,8]]}
[null,{"$f":"IF(A6=\"lt\",\"↖ atgal į turinį\",\"\")","v":"↖ atgal į turinį"}]
[null,null,null,null,null,{"$f":"IF(A4=\"en\",\"↖ back to content\",\"\")","v":""}]
[]
[{"$f":"+[0]!Kalba","v":"LT"},{"$f":"IF(A4=\"LT\",\"1 lentelė. Savivaldybių biudžetų fiskalinės drausmės taisyklės, 2019 m.\",\"\")","v":"1 lentelė. Savivaldybių biudžetų fiskalinės drausmės taisyklės, 2019 m."},null,null,null,{"$f":"IF(A4=\"EN\",\"Table 1. Fiscal discipline rules attributable to local government\",\"\")","v":""}]
[]
[{"$f":"Kalba","v":"LT"},"Nr.","Taisyklė","Taisyklė, išreikšta formule","Išvada","No.","Rule","Formula","Conclusion"]
[null,"T21","Kiekvienas valdžios sektoriui priskiriamas biudžetas, išskyrus VSDF, valstybės biudžetą, kurio asignavimai viršija 0,3 proc. praėjusių metų BVP to meto kainomis, turi būti planuojamas, tvirtinamas, keičiamas ir vykdomas taip, kad, sprendžiant pagal to biudžeto struktūrinį balanso rodiklį, apskaičiuotą kaupiamuoju principu, jis būtų perteklinis arba subalansuotas.","SBj,2019 ≥ 0","Visų savivaldybių (Kauno, Klaipėdos, Šiaulių ir Vilniaus miestų) biudžeto struktūriniai balanso rodikliai buvo subalansuoti*","R21","Each budget attributable to local government sector, with the exception of the budget of the State Social Insurance Fund of the Republic of Lithuania, planned appropriations of which exceeds 0.3 % of GDP in the preceding year at current prices, must be planned, approved, amended and implemented to be in surplus or balanced when judged by its structural balance indicator calculated on accrual basis.","SBj,2019 ≥ 0","All local governments (Kaunas, Klaipėda, Šiauliai and Vilnius) follow fiscal rule*"]
[null,"T4","Kiekvienas j–asis vietos valdžios sektoriui priskiriamas biudžetas, kurio asignavimai neviršija 0,3 proc. praėjusių metų BVP to meto kainomis, turi būti planuojamas, tvirtinamas, keičiamas ir vykdomas taip, kad to biudžeto asignavimai neviršytų jo pajamų, išskyrus metus, kuriais numatomas neigiamas produkcijos atotrūkis nuo potencialo. Pastaruoju atveju asignavimai negali viršyti pajamų daugiau kaip 1,5 procento.","AP2019 ≥ 0 ir","Tenkinama","R4","Each j-th budget attributable to local government sector the planned appropriations of which do not exceed 0.3 % of GDP in the preceding year at current prices shall be planned, approved, amended and implemented in such a way that the appropriations of the budget would not exceed its revenue, with the exception of the year when a negative output gap is projected. In the latter case, the appropriations may not exceed revenue by more than 1.5 %.","OG2019 ≥ 0 and","Valid"]
[]
[null,null,null,"SAj,2019/SPj,2019 ≤ 1","53 savivaldybių biudžetai buvo perviršiniai arba subalansuoti",null,null,"LEj,2019/LRj,2019 ≤ 1","53 local governments follow fiscal rule"]
[null,null,null,"AP2019 < 0 ir","Negalioja",null,null,"OG2019 < 0 and","Not valid"]
[null,null,null,"SAj,2019/SPj,2019 ≤ 1,015","1,5 > 0,0",null,null,"LEj,2019/LRj,2019 ≤ 1,015","1,5 > 0,0"]
[null,"* Struktūrinio balanso rezultatas apvalinamas vieno skaitmens po kablelio tikslumu.",null,null,null,"* The result of structural balance indicator is rounded to one decimal place. "]
[null,"Šaltinis – Fiskalinės institucijos skaičiavimai",null,null,null,"Source – Independent fiscal institution calculations"]

{"sheet":"2 lentelė ","index":4,"n_rows":34,"n_cols":21,"rows_kept":34,"cut":false,"hidden":false,"merged":[[11,19,12,20],[6,1,6,12],[8,1,8,12],[9,1,9,12],[19,19,20,19],[11,14,12,14],[11,16,12,16],[13,18,14,18],[11,10,12,10],[11,1,12,1],[11,15,12,15],[13,17,14,17],[11,17,12,18],[13,19,14,19],[13,20,14,20],[19,20,20,20],[11,2,12,2],[11,3,12,3],[11,4,12,4],[11,5,12,5],[11,6,12,6],[19,18,20,18],[11,11,12,11],[11,12,12,12],[11,13,12,13],[11,7,12,7],[11,8,12,8],[11,9,12,9],[19,16,20,16],[19,17,20,17]]}
[null,{"$f":"IF(A4=\"lt\",\"↖ atgal į turinį\",\"\")","v":"↖ atgal į turinį"}]
[null,{"$f":"IF(A4=\"en\",\"↖ back to content\",\"\")","v":""}]
[]
[{"$f":"Kalba","v":"LT"}]
[null,{"$f":"IF(A4=\"LT\",\"\",\"Table 2. Budgets attributable to local government in 2019, CL 4.2.\")","v":""}]
[null,{"$f":"IF(A4=\"en\",\"In accordance with Art. 4(2) of the CL, budgets of local governments the planned appropriations of which are equal or exceeds 0.3 % of GDP in the preceding year at current prices, must be planned,\",\"\")","v":""}]
[null,{"$f":"IF(A4=\"en\",\"approved, amended and implemented to be in surplus or balanced when judged by its structural balance indicator calculated on accrual basis.\",\"\")","v":""}]
[null,{"$f":"IF(A4=\"LT\",\"2 lentelė. Savivaldybių 2019 m. biudžetai, kuriems taikoma Konstitucinio įstatymo 4 str. 2 d.\",\" \")","v":"2 lentelė. Savivaldybių 2019 m. biudžetai, kuriems taikoma Konstitucinio įstatymo 4 str. 2 d."}]
[null,{"$f":"IF(A4=\"lt\",\"Remiantis KĮ 4 str. 2 d., savivaldybių, kurių planuojami asignavimai viršija arba yra lygūs 0,3 proc. praėjusių metų BVP to meto kainomis, biudžetai turi būti planuojami, tvirtinami, keičiami ir vykdomi taip,\",\"\")","v":"Remiantis KĮ 4 str. 2 d., savivaldybių, kurių planuojami asignavimai viršija arba yra lygūs 0,3 proc. praėjusių metų BVP to meto kainomis, biudžetai turi būti planuojami, tvirtinami, keičiami ir vykdomi taip,"}]
[null,{"$f":"IF(A4=\"lt\",\"kad sprendžiant pagal to biudžeto struktūrinį balanso rodiklį, apskaičiuotą kaupiamuoju principu, jis būtų perteklinis arba subalansuotas.\",\"\")","v":"kad sprendžiant pagal to biudžeto struktūrinį balanso rodiklį, apskaičiuotą kaupiamuoju principu, jis būtų perteklinis arba subalansuotas."}]
[{"$f":"Kalba","v":"LT"}]
[null,{"$f":"IF(A4=\"LT\",\"Savivaldybė\", \"Local government\")","v":"Savivaldybė"},{"$f":"IF(A4=\"LT\",\"Kodas\",\"Code\")","v":"Kodas"},{"$f":"IF(A4=\"LT\",\"Asignavimai, proc. BVP\",\"Appropriations, % of GDP\")","v":"Asignavimai, proc. BVP"},{"$f":"IF(A4=\"LT\",\"εi, pot. BVP\",\"εi, pot. GDP\")","v":"εi, pot. BVP"},{"$f":"IF(A4=\"LT\",\"εi, pot. BVP\",\"εi, pot. GDP\")","v":"εi, pot. BVP"},{"$f":"IF(A4=\"LT\",\"Pajamos, tūkst. EUR\",\"Revenues, thousands EUR\")","v":"Pajamos, tūkst. EUR"},{"$f":"IF(A4=\"LT\",\"Asignavimai, tūkst. EUR\",\"Expenditures, thousands EUR\")","v":"Asignavimai, tūkst. EUR"},{"$f":"IF(A4=\"LT\",\"Balansas, tūkst. EUR\",\"Balance, thousands EUR\")","v":"Balansas, tūkst. EUR"},{"$f":"IF(A4=\"LT\",\"Nepanaudota praėjusių metų pajamų dalis (2018-12-31), tūkst. EUR\",\"Revenue, carried forward to the following budget year (31/12/2018), thousands EUR\")","v":"Nepanaudota praėjusių metų pajamų dalis (2018-12-31), tūkst. EUR"},{"$f":"IF(A4=\"LT\",\"Nepanaudota praėjusių metų pajamų dalis (2018-12-31), tūkst. EUR\",\"Revenue, carried forward to the following budget year (31/12/2018), thousands EUR\")","v":"Nepanaudota praėjusių metų pajamų dalis (2018-12-31), tūkst. EUR"},{"$f":"IF(A4=\"LT\",\"Mokėtinų sumų metinis pokytis, tūkst. EUR\",\"Change in accounts payable, thousands EUR\")","v":"Mokėtinų sumų metinis pokytis, tūkst. EUR"},{"$f":"IF(A4=\"LT\",\"Balansas kaupiamuoju principu, tūkst. EUR\",\"Balance on accrual basis, thousands EUR\")","v":"Balansas kaupiamuoju principu, tūkst. EUR"},{"$f":"IF(A4=\"LT\",\"Balansas kaupiamuoju principu, proc. BVP\",\"Balance on accrual basis, % of GDP\")","v":"Balansas kaupiamuoju principu, proc. BVP"},{"$f":"IF(A4=\"LT\",\"Asignavimų dalis nuo visų valdžios sektoriaus išlaidų, proc.\", \"Share of approprations to total expenditure, %\")","v":"Asignavimų dalis nuo visų valdžios sektoriaus išlaidų, proc."},{"$f":"IF(A4=\"LT\",\"Ciklinė biudžeto dedamoji, proc. BVP\",\"Cyclical budgetary component,% of GDP\")","v":"Ciklinė biudžeto dedamoji, proc. BVP"},{"$f":"IF(A4=\"LT\",\"Struktūrinis balansas, proc. BVP\",\"Structural balance, % of GDP\")","v":"Struktūrinis balansas, proc. BVP"},{"$f":"IF($A$4=\"LT\",\"Ar laikomasi fiskalinės drausmės taisyklės:\", \"Fiscal rule\")","v":"Ar laikomasi fiskalinės drausmės taisyklės:"},null,"Fiscal rule"]
[]
[null,null,null,null,null,null,1,2,"3=1-2",4,5,6,"7=3+5+6",8,9,10,"11=8-10","IFI","FM","IFI","FM"]
[null,null,null,"–","–","–",{"$f":"IF(A4=\"LT\",\"FM įsakymo Nr. 1K-006 forma SB-1-pajamos (73 eilutė)\",\"Order MoF No. 1K-006 form SB-1-revenue (row 73)\")","v":"FM įsakymo Nr. 1K-006 forma SB-1-pajamos (73 eilutė)"},{"$f":"IF(A4=\"LT\",\"FM įsakymo Nr. 1K-006 forma SB-3-išlaidos (1+77-102+111 eilutės)\",\"Order MoF No. 1K-006 form SB-3-expenditure (rows 1+77-102+111)\")","v":"FM įsakymo Nr. 1K-006 forma SB-3-išlaidos (1+77-102+111 eilutės)"},"–",{"$f":"IF(A4=\"LT\",\"FM įsakymo Nr. 1K-361 forma Nr. 1-SAV (105 eilutė)\",\"Order MoF No. 1K-361 form No. A-SAV (row 105)\")","v":"FM įsakymo Nr. 1K-361 forma Nr. 1-SAV (105 eilutė)"},{"$f":"IF(A4=\"LT\",\"Pagal savivaldybių patikslintus duomenis\",\"According to the updated data provided by local governments\")","v":"Pagal savivaldybių patikslintus duomenis"},{"$f":"IF(A4=\"lt\",\"Pagal savivaldybių pateiktas mokėtinų sumų prognozes\",\"According to the forecasts of accounts payables provided by local governments\")","v":"Pagal savivaldybių pateiktas mokėtinų sumų prognozes"},"–","–","–","–","–"]
[null,"Vilniaus m.",1,{"$f":"H16/$C$25/10","v":1.4535414964466662},{"$f":"IF(D16>0.3,H16/$C$27/1000*$C$29,0)","v":1.5883828900371252E-2},{"$f":"IF(D16>0.3,H16/$D$27/1000*$D$29,0)","v":1.5898468288072513E-2},642064.30000000005,{"$f":"554170.7+100987.5+590.1","v":655748.29999999993},{"$f":"ROUND(G16-H16,1)","v":-13684},39584.400000000001,39584.5,{"$f":"38155.5-38100","v":55.5},{"$f":"I16+K16+L16","v":25956},{"$f":"M16/1000/$C$24*100","v":5.479518524532076E-2},{"$f":"H16/1000/$C$27*100","v":3.8459634141334758},{"$f":"0.413*O16*$C$26/100","v":2.4013908663743408E-2},{"$f":"N16-0.413*O16*$C$26/100","v":3.0781276581577352E-2},{"$f":"IF(M16/$C$24/10-E16*$C$26<-0.05,\"Ne\",\"Taip\")","v":"Taip"},{"$f":"IF(M16/$D$24/10-F16*$D$26<-0.05,\"Ne\",\"Taip\")","v":"Taip"},{"$f":"IF($A$4=\"LT\",\"\",IF(R16=\"Taip\",\"Yes\",\"No\") )","v":""},""]
[null,"Kauno m.",5,{"$f":"H17/$C$25/10","v":0.69402768774420365},{"$f":"IF(D17>0.3,H17/$C$27/1000*$C$29,0)","v":7.5841089306346501E-3},{"$f":"IF(D17>0.3,H17/$D$27/1000*$D$29,0)","v":7.591098851748794E-3},289128,{"$f":"268401.4+44701.1","v":313102.5},{"$f":"ROUND(G17-H17,1)","v":-23974.5},23974.5,23974.5,{"$f":"4657.5-4638","v":19.5},{"$f":"I17+K17+L17","v":19.5},{"$f":"M17/1000/$C$24*100","v":4.1166054564792529E-5},{"$f":"H17/1000/$C$27*100","v":1.8363459880471313},{"$f":"0.413*O17*$C$26/100","v":1.1466007365005327E-2},{"$f":"N17-0.413*O17*$C$26/100","v":-1.1424841310440534E-2},{"$f":"IF(M17/$C$24/10-E17*$C$26<-0.05,\"Ne\",\"Taip\")","v":"Taip"},{"$f":"IF(M17/$D$24/10-F17*$D$26<-0.05,\"Ne\",\"Taip\")","v":"Taip"},"",""]
[null,"Klaipėdos m.",6,{"$f":"H18/$C$25/10","v":0.45032705339808804},{"$f":"IF(D18>0.3,H18/$C$27/1000*$C$29,0)","v":4.9210276300123753E-3},{"$f":"IF(D18>0.3,H18/$D$27/1000*$D$29,0)","v":4.9255631127235154E-3},183555.4,{"$f":"161562.3+41184.9+412.6","v":203159.8},{"$f":"ROUND(G18-H18,1)","v":-19604.400000000001},26724.6,26724.6,{"$f":"1832-2163.6","v":-331.59999999999991},{"$f":"I18+K18+L18","v":6788.5999999999967},{"$f":"M18/1000/$C$24*100","v":1.4331275795823099E-2},{"$f":"H18/1000/$C$27*100","v":1.1915321138044492},7.4398376348735916E-3,{"$f":"N18-0.413*O18*$C$26/100","v":6.8914381609495078E-3},{"$f":"IF(M18/$C$24/10-E18*$C$26<-0.05,\"Ne\",\"Taip\")","v":"Taip"},{"$f":"IF(M18/$D$24/10-F18*$D$26<-0.05,\"Ne\",\"Taip\")","v":"Taip"},"",""]
[null,"Šiaulių m.",11,{"$f":"H19/$C$25/10","v":0.34074691920629813},{"$f":"IF(D19>0.3,H19/$C$27/1000*$C$29,0)","v":3.7235715500607029E-3},{"$f":"IF(D19>0.3,H19/$D$27/1000*$D$29,0)","v":3.727003393094056E-3},137940.1,{"$f":"107412.7+46311.3","v":153724},{"$f":"ROUND(G19-H19,1)","v":-15783.9},14835.9,14835.9,0,{"$f":"I19+K19+L19","v":-948},{"$f":"M19/1000/$C$24*100","v":-2.0013035757652981E-3},{"$f":"H19/1000/$C$27*100","v":0.90159117434883829},5.6294680373937559E-3,{"$f":"N19-0.413*O19*$C$26/100","v":-7.6307716131590545E-3},{"$f":"IF(M19/$C$24/10-E19*$C$26<-0.05,\"Ne\",\"Taip\")","v":"Taip"},{"$f":"IF(M19/$D$24/10-F19*$D$26<-0.05,\"Ne\",\"Taip\")","v":"Taip"},"",""]
[null,null,null,null,null,null,null,null,null,null,null,null,null,null,null,null,{"$f":"IF(A4=\"lt\",\"T21 (iš viso nesilaiko savivaldybių)\",\"T4 (total do not comply)\")","v":"T21 (iš viso nesilaiko savivaldybių)"},{"$f":"COUNTIF(R16:R19,\"Ne\")","v":0},{"$f":"COUNTIF(S16:S19,\"Ne\")","v":0},{"$f":"IF($A$4=\"LT\",\"\",R20 )","v":""},{"$f":"IF($A$4=\"LT\",\"\",S20 )","v":""}]
[null,null,null,null,null,null,null,null,null,null,null,null,null,null,null,null,null,null,null,{"$f":"IF($A$4=\"LT\",\"\",R21 )","v":""},{"$f":"IF($A$4=\"LT\",\"\",S21 )","v":""}]
[]
[null,{"$f":"Savivaldybės!B70","v":"2018 m. potencialus BVP, mln. EUR "},{"$f":"Savivaldybės!C70","v":36551.251193186399},{"$f":"Savivaldybės!D70","v":36142.370048151301}]
[null,{"$f":"Savivaldybės!B71","v":"2019 m. BVP projekcija, mln. EUR "},{"$f":"Savivaldybės!C71","v":47369.125378066885},{"$f":"Savivaldybės!D71","v":47369.125378066885}]
[null,{"$f":"Savivaldybės!B72","v":"2018 m. BVP, mln. EUR "},{"$f":"Savivaldybės!C72","v":45113.834149423667},{"$f":"Savivaldybės!D72","v":45113.834149423667}]
[null,{"$f":"Savivaldybės!B73","v":"2019 m. atotrūkis nuo potencialo, proc. pot. BVP "},{"$f":"Savivaldybės!C73","v":1.5118463447552077},{"$f":"Savivaldybės!D73","v":1.4804051828047164}]
[null,{"$f":"Savivaldybės!B74","v":"2019 m. projektuotos valžios sektoriaus išlaidos, mln. EUR "},{"$f":"Savivaldybės!C74","v":17050.3},{"$f":"Savivaldybės!D74","v":17034.599999999999}]
[null,{"$f":"Savivaldybės!B75","v":"2018 m. visos išlaidos, mln. EUR "},{"$f":"Savivaldybės!C75","v":15342.75850251552},{"$f":"Savivaldybės!D75","v":15342.75850251552}]
[null,{"$f":"Savivaldybės!B76","v":"Valdžios sektoriaus biudžeto dalinis elastingumas"},{"$f":"Savivaldybės!C76","v":0.41299999999999998},{"$f":"Savivaldybės!D76","v":0.41299999999999998}]
[]
[null,{"$f":"+Savivaldybės!B78","v":"Šaltiniai:"}]
[null,{"$f":"+Savivaldybės!B79","v":"Finansų ministerija (FM)"}]
[null,{"$f":"+Savivaldybės!B80","v":"Fiskalinės institucijos skaičiavimai (IFI)"}]
[null,{"$f":"+Savivaldybės!B81","v":"Faktiniai duomenys"}]

{"sheet":"3 lentelė","index":5,"n_rows":85,"n_cols":13,"rows_kept":85,"cut":false,"hidden":false,"merged":[[4,1,4,10],[3,1,3,10],[7,1,7,10],[8,1,8,10],[10,11,11,11],[72,4,72,10],[73,4,73,10],[70,12,71,12],[10,1,11,1],[10,2,11,2],[10,3,11,3],[10,4,11,4],[10,5,11,5],[10,6,11,6],[10,7,11,7],[10,9,11,9],[10,10,11,10],[70,10,71,10],[70,11,71,11],[10,8,11,8],[10,12,11,12]]}
[null,{"$f":"IF(A4=\"lt\",\"↖ atgal į turinį\",\"\")","v":"↖ atgal į turinį"}]
[null,{"$f":"IF(A4=\"en\",\"↖ back to content\",\"\")","v":""}]
[null,{"$f":"IF(A4=\"en\",\"Table 3. Budget data of local govenrnments in 2019, CL 4.4.\",\"\")","v":""}]
[{"$f":"Kalba","v":"LT"},{"$f":"IF(A4=\"en\",\"In accordance with Art. 4(2) of the CL, budgets of local governments the planned appropriations of which do not exceed 0.3 % of GDP in the preceding year at current prices shall be planned,\",\"\")","v":""}]
[null,{"$f":"IF(A4=\"en\",\"approved, amended and implemented in such a way that the appropriations of the budget would not exceed its revenue.\",\"\")","v":""}]
[null,{"$f":"IF(A4=\"LT\",\"\",\"Since a positive output gap for the year 2019 is forecasted, the budgets of the indicated local governments shall be planned without deficit.\")","v":""}]
[null,{"$f":"IF(A4=\"LT\",\"3 lentelė. Savivaldybių 2019 m. biudžetai, kuriems taikoma Konstitucinio įstatymo 4 str. 4 d.\",\"\")","v":"3 lentelė. Savivaldybių 2019 m. biudžetai, kuriems taikoma Konstitucinio įstatymo 4 str. 4 d."}]
[null,{"$f":"IF(A4=\"lt\",\"Vadovaujantis KĮ 4 str. 4 d., savivaldybių, kurių planuojami asignavimai neviršija 0,3 proc. praėjusių metų BVP to meto kainomis, biudžetai turi būti planuojami, tvirtinami, keičiami ir vykdomi taip, kad jų asignavimai neviršytų pajamų.\",\"\")","v":"Vadovaujantis KĮ 4 str. 4 d., savivaldybių, kurių planuojami asignavimai neviršija 0,3 proc. praėjusių metų BVP to meto kainomis, biudžetai turi būti planuojami, tvirtinami, keičiami ir vykdomi taip, kad jų asignavimai neviršytų pajamų."}]
[null,{"$f":"IF(A4=\"lt\",\"Kadangi 2019 m. numatomas teigiamas produkcijos atotrūkis  nuo potencialo, tai reiškia, kad nurodytų savivaldybių biudžetų balanso rodikliai turėtų būti planuojami be deficito.\",\"\")","v":"Kadangi 2019 m. numatomas teigiamas produkcijos atotrūkis  nuo potencialo, tai reiškia, kad nurodytų savivaldybių biudžetų balanso rodikliai turėtų būti planuojami be deficito."}]
[{"$f":"Kalba","v":"LT"}]
[null,{"$f":"IF(A4=\"LT\",\"Savivaldybė\", \"Local government\")","v":"Savivaldybė"},{"$f":"IF(A4=\"LT\",\"Kodas\",\"Code\")","v":"Kodas"},{"$f":"IF(A4=\"LT\",\"Asignavimai, proc. BVP\",\"Appropriations, % of GDP\")","v":"Asignavimai, proc. BVP"},{"$f":"IF(A4=\"LT\",\"Pajamos, tūkst. EUR\",\"Revenues, thousands EUR\")","v":"Pajamos, tūkst. EUR"},{"$f":"IF(A4=\"LT\",\"Asignavimai, tūkst. EUR\",\"Expenditures, thousands EUR\")","v":"Asignavimai, tūkst. EUR"},{"$f":"IF(A4=\"LT\",\"Balansas, tūkst. EUR\",\"Balance, thousands EUR\")","v":"Balansas, tūkst. EUR"},{"$f":"IF(A4=\"LT\",\"Nepanaudota praėjusių metų pajamų dalis (2018-12-31), tūkst. EUR\",\"Revenue, carried forward to the following budget year (31/12/2018), thousands EUR\")","v":"Nepanaudota praėjusių metų pajamų dalis (2018-12-31), tūkst. EUR"},{"$f":"IF(A4=\"LT\",\"Nepanaudota praėjusių metų pajamų dalis (2018-12-31), tūkst. EUR\",\"Revenue, carried forward to the following budget year (31/12/2018), thousands EUR\")","v":"Nepanaudota praėjusių metų pajamų dalis (2018-12-31), tūkst. EUR"},{"$f":"IF(A4=\"LT\",\"Balansas, koreguotas praėjusių metų nepanaudota pajamų dalimi, tūkst. EUR\",\"Balance, adjusted to revenue carried forward to the following budget year\")","v":"Balansas, koreguotas praėjusių metų nepanaudota pajamų dalimi, tūkst. EUR"},{"$f":"IF(A4=\"LT\",\"Balansas, koreguotas nepanaudota praėjusių metų pajamų dalimi, proc. BVP\",\"Balance adjusted to revenue caried forward to the following budget year, % of GDP\")","v":"Balansas, koreguotas nepanaudota praėjusių metų pajamų dalimi, proc. BVP"},{"$f":"IF($A$4=\"LT\",\"Ar laikomasi fiskalinės drausmės taisyklės:\", \"Fiscal rule\")","v":"Ar laikomasi fiskalinės drausmės taisyklės:"},{"$f":"IF($A$4=\"LT\",\"\", \"Fiscal rule\")","v":""}]
[]
[null,null,null,null,1,2,"3=1-2",4,5,"6=3+5",7]
[null,null,null,"–",{"$f":"IF(A4=\"LT\",\"FM įsakymo Nr. 1K-006 forma SB-1-pajamos (73 eilutė)\",\"Order MoF No. 1K-006 form SB-1-revenue (row 73)\")","v":"FM įsakymo Nr. 1K-006 forma SB-1-pajamos (73 eilutė)"},{"$f":"IF(A4=\"LT\",\"FM įsakymo Nr. 1K-006 forma SB-3-išlaidos (1+77-102+111 eilutės)\",\"Order MoF No. 1K-006 form SB-3-expenditure (rows 1+77-102+111)\")","v":"FM įsakymo Nr. 1K-006 forma SB-3-išlaidos (1+77-102+111 eilutės)"},"–",{"$f":"IF(A4=\"LT\",\"FM įsakymo Nr. 1K-361 forma Nr. 1-SAV (105 eilutė)\",\"Order MoF No. 1K-361 form No. A-SAV (row 105)\")","v":"FM įsakymo Nr. 1K-361 forma Nr. 1-SAV (105 eilutė)"},{"$f":"IF(A4=\"LT\",\"Pagal savivaldybių patikslintus duomenis\",\"According to the updated data provided by local governments\")","v":"Pagal savivaldybių patikslintus duomenis"},"–","–","–","–"]
[null,"Alytaus m.",2,{"$f":"F15/$C$77/10","v":0.13954655193235058},58615.9,{"$f":"52077.5+10877.3","v":62954.8},{"$f":"ROUND(E15-F15,1)","v":-4338.8999999999996},4900.7,4900.7,{"$f":"ROUND(G15+I15,0)","v":562},{"$f":"J15/1000/$C$76*100","v":1.1864268033545335E-3},{"$f":"+IF(($C$78+0.05>=0)*(J15<0),\"Ne\",IF(($C$78+0.05<0)*(F15/E15>1.015),\"Ne\",\"Taip\"))","v":"Taip"},{"$f":"IF($A$4=\"LT\",\"\",IF(L15=\"Taip\",\"Yes\",(IF(L15=\"Taip*\",\"Yes*\",\"No\"))))","v":""}]
[null,"Birštono m.",3,2.1168229613048747E-2,8999.1,{"$f":"8215.8+1334","v":9549.7999999999993},-550.70000000000005,97.1,551.70000000000005,{"$f":"ROUND(G16+I16,0)","v":1},2.1110797212714118E-6,"Taip",{"$f":"IF($A$4=\"LT\",\"\",IF(L16=\"Taip\",\"Yes\",(IF(L16=\"Taip*\",\"Yes*\",\"No\"))))","v":""}]
[null,"Druskininkų m.",4,4.9610946225207779E-2,20662.599999999999,{"$f":"19294.6+3086.8","v":22381.399999999998},-1718.8,0,1718.8,0,0,"Taip",""]
[null,"Marijampolės m.",7,0.10646579016297952,48528,{"$f":"46161+1869.8","v":48030.8},497.2,686.4,483.8,981,2.0709692065672548E-3,"Taip",""]
[null,"Neringos m.",8,2.4861331809775435E-2,9688.7000000000007,{"$f":"9957.9+1258","v":11215.9},-1527.2,1702.2,1702.2,175,3.6943895122249707E-4,"Taip",""]
[null,"Palangos m.",9,5.442942384074375E-2,24607.1,{"$f":"21510.7+3096.4-51.9","v":24555.200000000001},51.9,627.79999999999995,627.79999999999995,680,1.4355342104645601E-3,"Taip",""]
[null,"Panevėžio m.",10,0.2278644720364856,102956.6,{"$f":"78851.4+23955.2-8.2","v":102798.39999999999},158.19999999999999,2668.3,2668.3,2827,5.9680223720342818E-3,"Taip",""]
[null,"Visagino m.",12,6.1654923649080574E-2,24145.5,{"$f":"22656.4+5158.5","v":27814.9},-3669.4,3734.7,3734.7,65,1.3722018188264178E-4,"Taip",""]
[null,"Akmenės r.",13,6.4872783596855693E-2,26731.7,{"$f":"23017.7+6248.9","v":29266.6},-2534.9,399.5,2534.9,0,0,"Taip",""]
[null,"Alytaus r.",14,5.4663941704265563E-2,20877.099999999999,{"$f":"20752.1+3908.9","v":24661},-3783.9,4499.2,4499.2,715,1.5094220007090594E-3,"Taip",""]
[null,"Anykščių r.",15,6.0284390614907278E-2,25945.1,{"$f":"23282+3914.6","v":27196.6},-1251.5,0,1251.5,0,0,"Taip",""]
[null,"Biržų r.",16,5.9713612260872642E-2,25615.3,{"$f":"23297.3+3641.8","v":26939.1},-1323.8,972.4,1416.5,93,1.963304140782413E-4,"Taip",""]
[null,"Ignalinos r.",17,3.7599553041351721E-2,15875.6,{"$f":"15618.6+1344","v":16962.599999999999},-1087,0,1086.9000000000001,0,0,"Taip",""]
[null,"Jonavos r.",18,0.10906432788893997,46393.2,{"$f":"41247.7+8042.7-87.3","v":49203.099999999991},-2809.9,3574.7,3574.7,765,1.61497598677263E-3,"Taip",""]
[null,"Joniškio r.",19,5.102315162076302E-2,22099.5,{"$f":"21760.8+1257.7","v":23018.5},-919,449.3,919,0,0,"Taip",""]
["-","Jurbarko r.",20,6.2760792856179151E-2,26395.9,{"$f":"25608.2+2705.6","v":28313.8},-1917.9,2037.2,2037.2,119,2.5121848683129798E-4,"Taip",""]
["-","Kaišiadorių r.",21,7.1429752331107682E-2,31200.1,{"$f":"27544.7+4680","v":32224.7},-1024.5999999999999,332.9,{"$f":"1286.1+119.9","v":1406},381,8.0432137380440799E-4,"Taip",""]
[null,"Kauno r.",22,{"$f":"F32/$C$77/10","v":0.18861154589115553},83141.5,{"$f":"68967.1+16122.8","v":85089.900000000009},-1948.4,0,2109.4,161,3.3988383512469729E-4,"Taip",""]
[null,"Kėdainių r.",23,0.13286545275993961,53225.2,{"$f":"46777.1+13163.6","v":59940.7},-6715.5,4848.2,7078.3,363,7.6632193882152251E-4,"Taip",""]
[null,"Kelmės r.",24,7.3176444925202033E-2,31143.4,{"$f":"26579+6433.7","v":33012.699999999997},-1869.3,1423.7,{"$f":"1423.7","v":1423.7},-446,-9.4154155568704971E-4,"Taip*",""]
[null,"Klaipėdos r.",25,0.12685886952202471,55843.7,{"$f":"48233.4+8997.5","v":57230.9},-1387.2,1513,1513,126,2.6599604488019787E-4,"Taip",""]
[null,"Kretingos r.",26,9.4464150084978799E-2,39885.300000000003,{"$f":"33650.1+8966.3","v":42616.399999999994},-2731.1,0,{"$f":"1755.6","v":1755.6},-976,-2.0604138079608979E-3,"Taip*",""]
[null,"Kupiškio r.",27,4.0220256916983416E-2,17759.8,{"$f":"16948.1+1196.8","v":18144.899999999998},-385.1,556.9,556.9,172,3.6310571205868281E-4,"Taip",""]
[null,"Lazdijų r.",28,4.8480915914967539E-2,21205.9,{"$f":"20239.8+1631.8","v":21871.599999999999},-665.7,1394.5,1394.5,729,1.5389771168068593E-3,"Taip",""]
[null,"Mažeikių r.",30,0.13679528943515523,59737.9,{"$f":"54134.6+7579","v":61713.599999999999},-1975.7,2454,2454,478,1.0090961067677348E-3,"Taip",""]
[null,"Molėtų r.",31,4.5639880511603635E-2,19930.400000000001,{"$f":"17389.1+3200.8","v":20589.899999999998},-659.5,682.3,682.3,23,4.8554833589242476E-5,"Taip",""]
[null,"Pakruojo r.",32,4.7522673264679474E-2,20990.6,{"$f":"20556.9+897.8-15.4","v":21439.3},-448.7,0,495.4,47,9.922074689975636E-5,"Taip",""]
[null,"Panevėžio r.",33,8.3652167259834015E-2,36549.699999999997,{"$f":"31344.8+6393.9","v":37738.699999999997},-1189,2565.5,2565.5,1377,2.9069567761907341E-3,"Taip",""]
[null,"Pasvalio r.",34,5.8476962770713702E-2,25837.599999999999,{"$f":"24782.7+1598.5","v":26381.200000000001},-543.6,543.6,543.6,0,0,"Taip",""]
[null,"Plungės r.",35,8.6671861829548169E-2,37835.1,{"$f":"30828.7+8272.3","v":39101},-1265.9000000000001,1265.9000000000001,1265.9000000000001,0,0,"Taip",""]
[null,"Prienų r.",36,5.6053537627156112E-2,25099.1,{"$f":"24057.4+1230.5","v":25287.9},-188.8,632.20000000000005,871.8,683,1.4418674496283744E-3,"Taip",""]
[null,"Radviliškio r.",37,9.0623642992938319E-2,36498.300000000003,{"$f":"37546.1+3337.7","v":40883.799999999996},-4385.5,525.79999999999995,4385.5,0,0,"Taip",""]
[null,"Raseinių r.",38,7.0728858678502787E-2,31381.9,{"$f":"30044.8+1893.6-29.9","v":31908.499999999996},-526.6,1183.7,1047.3,521,{"$f":"J47/1000/$C$76*100","v":1.0998725347824056E-3},{"$f":"+IF(($C$78+0.05>=0)*(J47<0),\"Ne\",IF(($C$78+0.05<0)*(F47/E47>1.015),\"Ne\",\"Taip\"))","v":"Taip"},""]
[null,"Rokiškio r.",39,6.4584623651129464E-2,28364.400000000001,{"$f":"28879.2+257.4","v":29136.600000000002},-772.2,772.2,772.2,0,0,"Taip",""]
[null,"Skuodo r.",40,4.1570397093459152E-2,18109,{"$f":"16342.1+2411.9","v":18754},-645,643.70000000000005,645,0,0,"Taip",""]
[null,"Šakių r.",41,6.5078263804308173E-2,28544.2,{"$f":"27084.7+2274.6","v":29359.3},-815.1,832.6,1223,408,8.6132052627873603E-4,"Taip",""]
[null,"Šalčininkų r.",42,6.7620056187110228E-2,30325.200000000001,{"$f":"30037.4+468.6","v":30506},-180.8,741.8,741.8,561,1.1843157236332623E-3,"Taip",""]
[null,"Šiaulių r.",43,7.8582103845529383E-2,34648.300000000003,{"$f":"32419.9+3031.5","v":35451.4},-803.1,839.4,839.4,{"$f":"ROUND(G52+I52,0)","v":36},7.5998869965770822E-5,"Taip",""]
[null,"Šilalės r.",44,5.7810426650099257E-2,25490.9,{"$f":"22520.6+3559.9","v":26080.5},-589.6,0,1039.5999999999999,450,9.4998587457213529E-4,"Taip",""]
[null,"Šilutės r.",45,9.6628009615886079E-2,42425.9,{"$f":"37895.2+5697.4","v":43592.6},-1166.7,0,1166.8,0,0,"Taip",""]
[null,"Širvintų r.",46,3.5776387230891549E-2,15542.1,{"$f":"14318.7+1821.4","v":16140.1},-598,950.8,950.8,353,7.452111416088083E-4,"Taip",""]
[null,"Švenčionių r.",47,6.5085800295196394E-2,28147.3,{"$f":"20877.1+8551.9-66.3","v":29362.7},-1215.4000000000001,1219.5,1219.5,4,8.4443188850856473E-6,"Taip",""]
[null,"Tauragės r.",48,9.6129271248282994E-2,40770.400000000001,{"$f":"34578.2+8789.4","v":43367.6},-2597.1999999999998,2597.1999999999998,2597.1999999999998,0,0,"Taip",""]
[null,"Telšių r.",49,9.097431148073748E-2,40182.300000000003,{"$f":"37310.5+3731.5","v":41042},-859.7,612.6,859.7,0,0,"Taip",""]
[null,"Trakų r.",50,9.0540298270174444E-2,39239.800000000003,{"$f":"32729.2+8129.1-12.1","v":40846.200000000004},-1606.4,2476.9,2476.9,871,1.8387504372273996E-3,"Taip",""]
[null,"Ukmergės r.",51,8.1756518139948858E-2,34426.1,{"$f":"33604.9+3329.6-51","v":36883.5},-2457.4,2542.1999999999998,2542.1999999999998,85,1.7944177630807001E-4,"Taip",""]
[null,"Utenos r.",52,8.3024643562640971E-2,36826.6,{"$f":"33604+3851.6","v":37455.599999999999},-629,675,674.6,46,9.7109667178484952E-5,"Taip",""]
[null,"Varėnos r.",53,5.22125872121222E-2,22127.200000000001,{"$f":"21463.1+2092","v":23555.1},-1427.9,1428,1428,0,0,"Taip",""]
[null,"Vilkaviškio r.",54,8.0164545270559787E-2,34950.800000000003,{"$f":"33632.1+2533.2","v":36165.299999999996},-1214.5,1091.7,1214.5,0,0,"Taip",""]
[null,"Vilniaus  r.",55,0.19756002051343843,83128.7,{"$f":"80878.4+8248.5","v":89126.9},-5998.2,5998.2,5998.2,0,0,"Taip",""]
[null,"Zarasų r.",56,4.2067140507591826E-2,17257.900000000001,{"$f":"16290.8+2687.3","v":18978.099999999999},-1720.2,211.7,1096.8,-623,-1.3152026663520895E-3,"Ne",""]
[null,"Elektrėnų sav.",57,7.2735560208240915E-2,31901.3,{"$f":"23725.4+9095.7-7.3","v":32813.800000000003},-912.5,488.7,197.89999999999998,-715,-1.5094220007090594E-3,"Ne",""]
[null,"Kalvarijos sav.",58,2.3596531309534007E-2,10403.299999999999,{"$f":"10317.1+328.2","v":10645.300000000001},-242,0,269,27,5.6999152474328113E-5,"Taip",""]
[null,"Kazlų Rūdos sav.",59,2.5551585710538109E-2,10974.3,{"$f":"10827.2+700.1","v":11527.300000000001},-553,31.9,558,5,1.055539860635706E-5,"Taip",""]
[null,"Pagėgių sav.",60,2.0595899628537119E-2,9135.2000000000007,{"$f":"8706.2+585.4","v":9291.6},-156.4,105.3,132.39999999999998,-24,-5.0665913310513884E-5,"Ne",""]
[null,"Rietavo sav.",61,2.1070698554495254E-2,9216.7000000000007,{"$f":"7540.3+1965.5","v":9505.7999999999993},-289.10000000000002,0,498.3,209,4.4121566174572507E-4,"Taip",""]
[null,null,null,null,null,null,null,null,null,null,{"$f":"IF(A4=\"lt\", \"T4 (iš viso nesilaiko savivaldybių)\",\"T4 (total do not comply)\")","v":"T4 (iš viso nesilaiko savivaldybių)"},{"$f":"COUNTIF($L$15:$L$70,\"Ne\")","v":3},{"$f":"IF($A$4=\"LT\",\"\",L71 )","v":""}]
[null,null,null,null,null,null,null,null,null,null,null,null,{"$f":"IF($A$4=\"LT\",\"\",L72 )","v":""}]
[null,null,null,null,{"$f":"IF(A4=\"LT\",\"* Deficitas investicijoms pagal Finansų ministro 2019-03-28 įsakymu Nr. 1K-98 „Dėl projektų atrankos“ patvirtintą tvarką. VšĮ CPVA patvirtinti ir į 2019 m. patvirtinto\",\"* Deficit for investments under the Order of the MoF No. 1K-098 of 28 March 2019. Investment projects, which are approved by the \")","v":"* Deficitas investicijoms pagal Finansų ministro 2019-03-28 įsakymu Nr. 1K-98 „Dėl projektų atrankos“ patvirtintą tvarką. VšĮ CPVA patvirtinti ir į 2019 m. patvirtinto"}]
[null,null,null,null,{"$f":"IF(A4=\"LT\",\"biudžeto asignavimus įtrauktos investicijos. Atitiktis KĮ nuostatoms turi būti užtikrinta per ketverių metų laikotarpį.\",\"Central Project Management Agency and included into local governments budgets of 2019. Compliance with the rules of Constitutional Law shall be ensured t+4.\")","v":"biudžeto asignavimus įtrauktos investicijos. Atitiktis KĮ nuostatoms turi būti užtikrinta per ketverių metų laikotarpį."}]
[null,{"$f":"Savivaldybės!B70","v":"2018 m. potencialus BVP, mln. EUR "},{"$f":"Savivaldybės!C70","v":36551.251193186399}]
[null,{"$f":"Savivaldybės!B71","v":"2019 m. BVP projekcija, mln. EUR "},{"$f":"Savivaldybės!C71","v":47369.125378066885}]
[null,{"$f":"Savivaldybės!B72","v":"2018 m. BVP, mln. EUR "},{"$f":"Savivaldybės!C72","v":45113.834149423667}]
[null,{"$f":"Savivaldybės!B73","v":"2019 m. atotrūkis nuo potencialo, proc. pot. BVP "},{"$f":"Savivaldybės!C73","v":1.5118463447552077}]
[null,{"$f":"Savivaldybės!B74","v":"2019 m. projektuotos valžios sektoriaus išlaidos, mln. EUR "},{"$f":"Savivaldybės!C74","v":17050.3}]
[null,{"$f":"Savivaldybės!B75","v":"2018 m. visos išlaidos, mln. EUR "},{"$f":"Savivaldybės!C75","v":15342.75850251552}]
[]
[null,{"$f":"+Savivaldybės!B78","v":"Šaltiniai:"}]
[null,{"$f":"+Savivaldybės!B79","v":"Finansų ministerija (FM)"}]
[null,{"$f":"+Savivaldybės!B80","v":"Fiskalinės institucijos skaičiavimai (IFI)"}]
[null,{"$f":"+Savivaldybės!B81","v":"Faktiniai duomenys"}]

{"sheet":"1 pav.","index":6,"n_rows":34,"n_cols":8,"rows_kept":34,"cut":false,"hidden":false,"merged":[[3,6,3,7]]}
[null,{"$f":"IF(A4=\"lt\",\"↖ atgal į turinį\",\"\")","v":"↖ atgal į turinį"}]
[null,{"$f":"IF(A4=\"en\",\"↖ back to content\",\"\")","v":""},{"$f":"IF(A4=\"en\",\"↖ back to content\",\"\")","v":""}]
[]
[{"$f":"Turinys!B2","v":"LT"},{"$f":"IF(A4=\"LT\",\"1 pav. Skirtumai tarp savivaldybių Finansų ministerijai pateiktų ir fiskalinei institucijai patikslintų duomenų apie nepanaudotą praėjusių metų pajamų dalį\",\"Figure 1. Differences between the data of revenue, carried forward to the following budget year, which were provided to the Ministry of Finance and to the updated data, provided Independent fiscal institution\")","v":"1 pav. Skirtumai tarp savivaldybių Finansų ministerijai pateiktų ir fiskalinei institucijai patikslintų duomenų apie nepanaudotą praėjusių metų pajamų dalį"},{"$f":"IF(B4=\"LT\",\"1 pav. Skirtumai tarp savivaldybių Finansų ministerijai pateiktų ir fiskalinei institucijai patikslintų duomenų apie nepanaudotą praėjusių metų pajamų dalį\",\"Figure 1. Differences between data of revenue, carried forward to the following budget year, provided to the Ministry of Finance and to the updated data, provided for Independent fiscal institution\")","v":"Figure 1. Differences between data of revenue, carried forward to the following budget year, provided to the Ministry of Finance and to the updated data, provided for Independent fiscal institution"},null,null,{"$f":"IF(A4=\"LT\",\"Savivaldybė\",\"Local government\")","v":"Savivaldybė"},{"$f":"IF(A4=\"LT\",\"Nepanaudota praėjusių metų pajamų dalis, tūkst. EUR\",\"Revenue, carried forward to the following budget year, thousands EUR\")","v":"Nepanaudota praėjusių metų pajamų dalis, tūkst. EUR"}]
[null,null,null,null,null,null,{"$f":"IF(A4=\"LT\",\"Finansų ministerijai pateikti duomenys\",\"Data provided to the MoF\")","v":"Finansų ministerijai pateikti duomenys"},{"$f":"IF(A4=\"LT\",\"Pagal savivaldybių patikslintus duomenis\",\"Updated data provided by local governments\")","v":"Pagal savivaldybių patikslintus duomenis"}]
[null,null,null,null,null,"Radviliškio r.",525.79999999999995,4385.5]
[null,null,null,null,null,"Kėdainių r.",4848.2,7078.3]
[null,null,null,null,null,"Akmenės r.",399.5,2534.9]
[null,null,null,null,null,"Kauno r.",0,2109.4]
[null,null,null,null,null,"Kretingos r.",0,1755.6]
[null,null,null,null,null,"Druskininkų m.",0,1718.8]
[null,null,null,null,null,"Anykščių r.",0,1251.5]
[null,null,null,null,null,"Šilutės r.",0,{"$f":"1308.1-141.3","v":1166.8}]
[null,null,null,null,null,"Ignalinos r.",0,1086.9000000000001]
[null,null,null,null,null,"Kaišiadorių r.",332.9,{"$f":"1286.1+119.9","v":1406}]
[null,null,null,null,null,"Šilalės r.",0,1039.5999999999999]
["-",null,null,null,null,"Zarasų r.",211.7,1096.8]
[null,null,null,null,null,"Kazlų Rūdos sav.",31.9,558]
[null,null,null,null,null,"Rietavo sav.",0,498.3]
[null,null,null,null,null,"Pakruojo r.",0,495.4]
[null,null,null,null,null,"Joniškio r.",449.3,919]
[null,null,null,null,null,"Birštono m.",97.1,551.70000000000005]
[null,null,null,null,null,"Biržų r.",972.4,1416.5]
[null,{"$f":"IF(A4=\"LT\",\"Šaltinis – Fiskalinės institucijos skaičiavimai\",\"Source - Independent fiscal institution calculations\")","v":"Šaltinis – Fiskalinės institucijos skaičiavimai"},{"$f":"IF(B4=\"LT\",\"Šaltinis – Fiskalinės institucijos skaičiavimai\",\"Source - Independent fiscal institution calculations\")","v":"Source - Independent fiscal institution calculations"},null,null,"Šakių r.",832.6,{"$f":"832.6+390.4","v":1223}]
[null,null,null,null,null,"Kalvarijos sav.",0,269]
[null,null,null,null,null,"Telšių r.",612.6,859.7]
[null,null,null,null,null,"Prienų r.",632.20000000000005,871.8]
[null,null,null,null,null,"Vilkaviškio r.",1091.7,1214.5]
[null,null,null,null,null,"Pagėgių sav.",105.3,{"$f":"5.7+9.6+105.3+5.1+6.7","v":132.39999999999998}]
[null,null,null,null,null,"Skuodo r.",643.70000000000005,645]
[null,null,null,null,null,"Utenos r.",675,{"$f":"675-0.4","v":674.6}]
[null,null,null,null,null,"Raseinių r.",1183.7,{"$f":"770.6+276.7","v":1047.3}]
[null,null,null,null,null,"Marijampolės m.",686.4,483.8]
[null,null,null,null,null,"Elektrėnų sav.",488.7,{"$f":"156.2+41.7","v":197.89999999999998}]

{"sheet":"2 pav.","index":7,"n_rows":30,"n_cols":5,"rows_kept":30,"cut":false,"hidden":false,"merged":[]}
[null,{"$f":"IF(A5=\"lt\",\"↖ atgal į turinį\",\"\")","v":"↖ atgal į turinį"},null,null,{"$f":"IF(A5=\"lt\",\"↖ atgal į turinį\",\"\")","v":"↖ atgal į turinį"}]
[]
["LT",{"$f":"IF(A5=\"en\",\"↖ back to content\",\"\")","v":""},null,null,{"$f":"IF(A5=\"en\",\"↖ back to content\",\"\")","v":""}]
[null,{"$f":"IF(A5=\"LT\",\"2 pav. Savivaldybių 2019 m. biudžetų fiskalinės drausmės taisyklių laikymosi vertinimas\",\"Figure 2. Local governments' compliance with Fiscal discipline for the year 2019\")","v":"2 pav. Savivaldybių 2019 m. biudžetų fiskalinės drausmės taisyklių laikymosi vertinimas"},null,null,{"$f":"IF(A5=\"LT\",\"2 pav. Savivaldybių 2019 m. biudžetų fiskalinės drausmės taisyklių laikymosi vertinimas\",\"Figure 2. Local governments' compliance with Fiscal discipline for the year 2019\")","v":"2 pav. Savivaldybių 2019 m. biudžetų fiskalinės drausmės taisyklių laikymosi vertinimas"}]
[{"$f":"+[0]!Kalba","v":"LT"}]
[]
[]
[]
[]
[]
[]
["-"]
[]
[]
[]
[]
[]
[]
[]
[]
[]
[]
[]
[]
[]
[]
[]
[null,{"$f":"IF(A5=\"LT\",\"Šaltinis – Fiskalinės institucijos skaičiavimai\",\"Source – Independent fiscal institution calculations\")","v":"Šaltinis – Fiskalinės institucijos skaičiavimai"},null,null,{"$f":"IF(A5=\"LT\",\"Šaltinis – Fiskalinės institucijos skaičiavimai\",\"Source – Independent fiscal institution calculations\")","v":"Šaltinis – Fiskalinės institucijos skaičiavimai"}]
[]
[null,"Nuoroda į interaktyvų žemėlapį ",null,null,"The link to interactive map"]